{"text_format":"1","workbook":"xlsx","n_sheets":11,"sheets":["Podzim - pořadí","Jaro","Jaro - pořadí","Pořadí 3","SKUPINA 3","SKUPINA 4","Pořadí 4","SKUPINA 5","Pořadí 5","Pořadí 6","SKUPINA 6"],"not_rendered":{"charts":0,"images":6,"macros":1,"external_links":0,"defined_names":0,"comments":0,"pivot_tables":0},"unopened":[],"bounds":{"document_bytes":16777216,"sheet_cells":100000,"rows_first":2000,"rows_last":500,"rows_between":2000,"halvings":0,"cell_chars":16384,"cell_head_chars":4096},"cells_cut":0,"cells_raw":0,"read":"whole","date_system":"1900"}

{"sheet":"Podzim - pořadí","index":0,"n_rows":20,"n_cols":13,"rows_kept":20,"cut":false,"hidden":true,"merged":[]}
[null,{"$f":"'SKUPINA 3'!$A$1","v":"SKUPINA 3 hlavního turnaje v kategorii U9"}]
[null,null,"Utkání celkem","Vítězství","Remízy","Prohry","Skóre",null,null,"Rozdíl","Body","Hodnocení skóre","Hodnocení družstva"]
[1,{"$f":"'SKUPINA 3'!C9","v":5},{"$f":"'SKUPINA 3'!AW12","v":0},{"$f":"'SKUPINA 3'!AX12","v":0},{"$f":"'SKUPINA 3'!AY12","v":0},{"$f":"'SKUPINA 3'!AZ12","v":0},{"$f":"'SKUPINA 3'!BA12","v":0},":",{"$f":"'SKUPINA 3'!BC12","v":0},{"$f":"SUM(G3-I3)","v":0},{"$f":"'SKUPINA 3'!BD12","v":0},{"$f":"IF(G3>I3,\"aktivní\",IF(G3=I3,\"vyrovnané\",\"pasivní\"))","v":"vyrovnané"},{"$f":"IF(K3>=80/100*C3*3,\"vynikající\",IF(K3<50/100*C3*3,\"neúspěšné\",\"dobré\"))","v":"vynikající"}]
[2,{"$f":"'SKUPINA 3'!C10","v":6},{"$f":"'SKUPINA 3'!AW13","v":0},{"$f":"'SKUPINA 3'!AX13","v":0},{"$f":"'SKUPINA 3'!AY13","v":0},{"$f":"'SKUPINA 3'!AZ13","v":0},{"$f":"'SKUPINA 3'!BA13","v":0},":",{"$f":"'SKUPINA 3'!BC13","v":0},0,{"$f":"'SKUPINA 3'!BD13","v":0},"vyrovnané","vynikající"]
[3,{"$f":"'SKUPINA 3'!#REF!","v":{"$error":"#REF!"}},{"$f":"'SKUPINA 3'!AW14","v":0},{"$f":"'SKUPINA 3'!AX14","v":0},{"$f":"'SKUPINA 3'!AY14","v":0},{"$f":"'SKUPINA 3'!AZ14","v":0},{"$f":"'SKUPINA 3'!BA14","v":0},":",{"$f":"'SKUPINA 3'!BC14","v":0},0,{"$f":"'SKUPINA 3'!BD14","v":0},"vyrovnané","vynikající"]
[4,{"$f":"'SKUPINA 3'!C8","v":"FC Slovácko"},{"$f":"'SKUPINA 3'!AW6","v":3},{"$f":"'SKUPINA 3'!AX6","v":3},{"$f":"'SKUPINA 3'!AY6","v":0},{"$f":"'SKUPINA 3'!AZ6","v":0},{"$f":"'SKUPINA 3'!BA6","v":12},":",{"$f":"'SKUPINA 3'!BC6","v":5},7,{"$f":"'SKUPINA 3'!BD6","v":9},"aktivní","vynikající"]
[5,{"$f":"'SKUPINA 3'!#REF!","v":{"$error":"#REF!"}},{"$f":"'SKUPINA 3'!AW5","v":3},{"$f":"'SKUPINA 3'!AX5","v":0},{"$f":"'SKUPINA 3'!AY5","v":0},{"$f":"'SKUPINA 3'!AZ5","v":3},{"$f":"'SKUPINA 3'!BA5","v":5},":",{"$f":"'SKUPINA 3'!BC5","v":18},-13,{"$f":"'SKUPINA 3'!BD5","v":0},"pasivní","neúspěšné"]
[6,{"$f":"'SKUPINA 3'!#REF!","v":{"$error":"#REF!"}},{"$f":"'SKUPINA 3'!AW7","v":3},{"$f":"'SKUPINA 3'!AX7","v":1},{"$f":"'SKUPINA 3'!AY7","v":0},{"$f":"'SKUPINA 3'!AZ7","v":2},{"$f":"'SKUPINA 3'!BA7","v":11},":",{"$f":"'SKUPINA 3'!BC7","v":18},-7,{"$f":"'SKUPINA 3'!BD7","v":3},"pasivní","neúspěšné"]
[7,{"$f":"'SKUPINA 3'!C12","v":8},{"$f":"'SKUPINA 3'!AW9","v":0},{"$f":"'SKUPINA 3'!AX9","v":0},{"$f":"'SKUPINA 3'!AY9","v":0},{"$f":"'SKUPINA 3'!AZ9","v":0},{"$f":"'SKUPINA 3'!BA9","v":0},":",{"$f":"'SKUPINA 3'!BC9","v":0},0,{"$f":"'SKUPINA 3'!BD9","v":0},"vyrovnané","vynikající"]
[8,{"$f":"'SKUPINA 3'!C11","v":7},{"$f":"'SKUPINA 3'!AW10","v":0},{"$f":"'SKUPINA 3'!AX10","v":0},{"$f":"'SKUPINA 3'!AY10","v":0},{"$f":"'SKUPINA 3'!AZ10","v":0},{"$f":"'SKUPINA 3'!BA10","v":0},":",{"$f":"'SKUPINA 3'!BC10","v":0},0,{"$f":"'SKUPINA 3'!BD10","v":0},"vyrovnané","vynikající"]
[9,{"$f":"'SKUPINA 3'!C13","v":9},{"$f":"'SKUPINA 3'!#REF!","v":{"$error":"#REF!"}},{"$f":"'SKUPINA 3'!#REF!","v":{"$error":"#REF!"}},{"$f":"'SKUPINA 3'!#REF!","v":{"$error":"#REF!"}},{"$f":"'SKUPINA 3'!#REF!","v":{"$error":"#REF!"}},{"$f":"'SKUPINA 3'!#REF!","v":{"$error":"#REF!"}},":",{"$f":"'SKUPINA 3'!#REF!","v":{"$error":"#REF!"}},{"$error":"#REF!"},{"$f":"'SKUPINA 3'!#REF!","v":{"$error":"#REF!"}},{"$error":"#REF!"},{"$error":"#REF!"}]
[10,{"$f":"'SKUPINA 3'!#REF!","v":{"$error":"#REF!"}},{"$f":"'SKUPINA 3'!AW8","v":3},{"$f":"'SKUPINA 3'!AX8","v":2},{"$f":"'SKUPINA 3'!AY8","v":0},{"$f":"'SKUPINA 3'!AZ8","v":1},{"$f":"'SKUPINA 3'!BA8","v":20},":",{"$f":"'SKUPINA 3'!BC8","v":7},13,{"$f":"'SKUPINA 3'!BD8","v":6},"aktivní","dobré"]
[11,{"$f":"'SKUPINA 3'!C14","v":10},{"$f":"'SKUPINA 3'!#REF!","v":{"$error":"#REF!"}},{"$f":"'SKUPINA 3'!#REF!","v":{"$error":"#REF!"}},{"$f":"'SKUPINA 3'!#REF!","v":{"$error":"#REF!"}},{"$f":"'SKUPINA 3'!#REF!","v":{"$error":"#REF!"}},{"$f":"'SKUPINA 3'!#REF!","v":{"$error":"#REF!"}},":",{"$f":"'SKUPINA 3'!#REF!","v":{"$error":"#REF!"}},{"$error":"#REF!"},{"$f":"'SKUPINA 3'!#REF!","v":{"$error":"#REF!"}},{"$error":"#REF!"},{"$error":"#REF!"}]
[12,{"$f":"'SKUPINA 3'!C6","v":"FK Meteor Praha"},{"$f":"'SKUPINA 3'!#REF!","v":{"$error":"#REF!"}},{"$f":"'SKUPINA 3'!#REF!","v":{"$error":"#REF!"}},{"$f":"'SKUPINA 3'!#REF!","v":{"$error":"#REF!"}},{"$f":"'SKUPINA 3'!#REF!","v":{"$error":"#REF!"}},{"$f":"'SKUPINA 3'!#REF!","v":{"$error":"#REF!"}},":",{"$f":"'SKUPINA 3'!#REF!","v":{"$error":"#REF!"}},{"$error":"#REF!"},{"$f":"'SKUPINA 3'!#REF!","v":{"$error":"#REF!"}},{"$error":"#REF!"},{"$error":"#REF!"}]
[13,{"$f":"'SKUPINA 3'!C5","v":"1.SK Prostějov"},{"$f":"'SKUPINA 3'!AW11","v":0},{"$f":"'SKUPINA 3'!AX11","v":0},{"$f":"'SKUPINA 3'!AY11","v":0},{"$f":"'SKUPINA 3'!AZ11","v":0},{"$f":"'SKUPINA 3'!BA11","v":0},":",{"$f":"'SKUPINA 3'!BC11","v":0},0,{"$f":"'SKUPINA 3'!BD11","v":0},"vyrovnané","vynikající"]
[14,{"$f":"'SKUPINA 3'!C7","v":"FC Velké Meziříčí"},{"$f":"'SKUPINA 3'!#REF!","v":{"$error":"#REF!"}},{"$f":"'SKUPINA 3'!#REF!","v":{"$error":"#REF!"}},{"$f":"'SKUPINA 3'!#REF!","v":{"$error":"#REF!"}},{"$f":"'SKUPINA 3'!#REF!","v":{"$error":"#REF!"}},{"$f":"'SKUPINA 3'!#REF!","v":{"$error":"#REF!"}},":",{"$f":"'SKUPINA 3'!#REF!","v":{"$error":"#REF!"}},{"$error":"#REF!"},{"$f":"'SKUPINA 3'!#REF!","v":{"$error":"#REF!"}},{"$error":"#REF!"},{"$error":"#REF!"}]
[15,{"$f":"'SKUPINA 3'!C15","v":11},{"$f":"'SKUPINA 3'!AW15","v":0},{"$f":"'SKUPINA 3'!AX15","v":0},{"$f":"'SKUPINA 3'!AY15","v":0},{"$f":"'SKUPINA 3'!AZ15","v":0},{"$f":"'SKUPINA 3'!BA15","v":0},":",{"$f":"'SKUPINA 3'!BC15","v":0},{"$f":"SUM(G17-I17)","v":0},{"$f":"'SKUPINA 3'!BD15","v":0},{"$f":"IF(G17>I17,\"aktivní\",IF(G17=I17,\"vyrovnané\",\"pasivní\"))","v":"vyrovnané"},{"$f":"IF(K17>=80/100*C17*3,\"vynikající\",IF(K17<50/100*C17*3,\"neúspěšné\",\"dobré\"))","v":"vynikající"}]
[16,{"$f":"'SKUPINA 3'!C16","v":12},{"$f":"'SKUPINA 3'!AW16","v":0},{"$f":"'SKUPINA 3'!AX16","v":0},{"$f":"'SKUPINA 3'!AY16","v":0},{"$f":"'SKUPINA 3'!AZ16","v":0},{"$f":"'SKUPINA 3'!BA16","v":0},":",{"$f":"'SKUPINA 3'!BC16","v":0},{"$f":"SUM(G18-I18)","v":0},{"$f":"'SKUPINA 3'!BD16","v":0},{"$f":"IF(G18>I18,\"aktivní\",IF(G18=I18,\"vyrovnané\",\"pasivní\"))","v":"vyrovnané"},{"$f":"IF(K18>=80/100*C18*3,\"vynikající\",IF(K18<50/100*C18*3,\"neúspěšné\",\"dobré\"))","v":"vynikající"}]
[17,{"$f":"'SKUPINA 3'!C17","v":13},{"$f":"'SKUPINA 3'!AW17","v":0},{"$f":"'SKUPINA 3'!AX17","v":0},{"$f":"'SKUPINA 3'!AY17","v":0},{"$f":"'SKUPINA 3'!AZ17","v":0},{"$f":"'SKUPINA 3'!BA17","v":0},":",{"$f":"'SKUPINA 3'!BC17","v":0},{"$f":"SUM(G19-I19)","v":0},{"$f":"'SKUPINA 3'!BD17","v":0},{"$f":"IF(G19>I19,\"aktivní\",IF(G19=I19,\"vyrovnané\",\"pasivní\"))","v":"vyrovnané"},{"$f":"IF(K19>=80/100*C19*3,\"vynikající\",IF(K19<50/100*C19*3,\"neúspěšné\",\"dobré\"))","v":"vynikající"}]
[18,{"$f":"'SKUPINA 3'!C18","v":14},{"$f":"'SKUPINA 3'!AW18","v":0},{"$f":"'SKUPINA 3'!AX18","v":0},{"$f":"'SKUPINA 3'!AY18","v":0},{"$f":"'SKUPINA 3'!AZ18","v":0},{"$f":"'SKUPINA 3'!BA18","v":0},":",{"$f":"'SKUPINA 3'!BC18","v":0},{"$f":"SUM(G20-I20)","v":0},{"$f":"'SKUPINA 3'!BD18","v":0},{"$f":"IF(G20>I20,\"aktivní\",IF(G20=I20,\"vyrovnané\",\"pasivní\"))","v":"vyrovnané"},{"$f":"IF(K20>=80/100*C20*3,\"vynikající\",IF(K20<50/100*C20*3,\"neúspěšné\",\"dobré\"))","v":"vynikající"}]

{"sheet":"Jaro","index":1,"n_rows":21,"n_cols":83,"rows_kept":21,"cut":false,"hidden":true,"merged":[[20,53,20,55],[1,81,2,81],[1,82,2,82],[2,50,2,52],[2,53,2,55],[1,50,1,52],[1,53,1,55],[1,57,2,57],[1,56,2,56],[1,60,2,62],[19,50,19,52],[1,63,2,63],[1,14,1,16],[1,17,1,19],[1,23,1,25],[1,26,1,28],[1,2,1,4],[1,5,1,7],[1,8,1,10],[1,11,1,13],[1,20,1,22],[2,2,2,4],[2,5,2,7],[2,8,2,10],[2,11,2,13],[2,14,2,16],[1,47,1,49],[1,58,2,58],[1,59,2,59],[2,44,2,46],[2,47,2,49],[2,35,2,37],[13,32,13,34],[12,29,12,31],[2,26,2,28],[1,44,1,46],[1,35,1,37],[1,29,1,31],[1,32,1,34],[2,38,2,40],[2,41,2,43],[1,38,1,40],[1,41,1,43],[2,32,2,34],[8,17,8,19],[9,20,9,22],[10,23,10,25],[11,26,11,28],[2,29,2,31],[2,17,2,19],[2,20,2,22],[2,23,2,25],[3,2,3,4],[4,5,4,7],[5,8,5,10],[6,11,6,13],[7,14,7,16],[15,38,15,40],[16,41,16,43],[17,44,17,46],[18,47,18,49],[14,35,14,37]]}
[null,null,{"$f":"'SKUPINA 3'!$A$1","v":"SKUPINA 3 hlavního turnaje v kategorii U9"}]
[null,null,1,null,null,2,null,null,3,null,null,4,null,null,5,null,null,6,null,null,7,null,null,8,null,null,9,null,null,10,null,null,11,null,null,12,null,null,13,null,null,14,null,null,15,null,null,16,null,null,17,null,null,18,null,null,"Utkání celkem","Vítězství","Remízy","Prohry","Skóre",null,null,"Body",null,null,null,null,null,null,null,null,null,null,null,null,null,null,null,null,null,"Hodnocení skóre","Hodnocení družstva"]
[null,null,{"$f":"B4","v":"1.SK Prostějov"},null,null,{"$f":"B5","v":"FK Meteor Praha"},null,null,{"$f":"B6","v":"FC Velké Meziříčí"},null,null,{"$f":"B7","v":"FC Slovácko"},null,null,{"$f":"B8","v":5},null,null,{"$f":"B9","v":6},null,null,{"$f":"B10","v":7},null,null,{"$f":"B11","v":8},null,null,{"$f":"B12","v":9},null,null,{"$f":"B13","v":10},null,null,{"$f":"B14","v":{"$error":"#REF!"}},null,null,{"$f":"B15","v":{"$error":"#REF!"}},null,null,{"$f":"B16","v":{"$error":"#REF!"}},null,null,{"$f":"B17","v":{"$error":"#REF!"}},null,null,{"$f":"B18","v":11},null,null,{"$f":"B19","v":12},null,null,{"$f":"B20","v":13},null,null,{"$f":"B21","v":14},null,null,null,null,null,null,null,null,null,null,2,3,4,5,6,7,8,9,10,11,12,13,14,15,16,17,18]
[1,{"$f":"'SKUPINA 3'!C5","v":"1.SK Prostějov"},null,null,null,null,":",null,null,":",null,null,":",null,null,":",null,null,":",null,null,":",null,null,":",null,null,":",null,null,":",null,null,":",null,null,":",null,null,":",null,null,":",null,null,":",null,null,":",null,null,":",null,null,":",null,{"$f":"COUNT(BM4:CC4)","v":0},{"$f":"COUNTIF(BM4:CC4,3)","v":0},{"$f":"COUNTIF(BM4:CC4,1)","v":0},{"$f":"COUNTIF(BM4:CC4,0)","v":0},{"$f":"SUM(C4,F4,I4,L4,O4,R4,U4,X4,AA4,AD4,AG4,AJ4,AM4,AP4,AS4,AV4,AY4,BB4)","v":0},":",{"$f":"SUM(E4,H4,K4,N4,Q4,T4,W4,Z4,AC4,AF4,AI4,AL4,AO4,AR4,AU4,AX4,BA4,BD4)","v":0},{"$f":"SUM(BM4:CC4)","v":0},{"$f":"IF(F4=\"\",\"\",IF(F4>H4,3,IF(F4=H4,1,0)))","v":""},{"$f":"IF(I4=\"\",\"\",IF(I4>K4,3,IF(I4=K4,1,0)))","v":""},{"$f":"IF(L4=\"\",\"\",IF(L4>N4,3,IF(L4=N4,1,0)))","v":""},{"$f":"IF(O4=\"\",\"\",IF(O4>Q4,3,IF(O4=Q4,1,0)))","v":""},{"$f":"IF(R4=\"\",\"\",IF(R4>T4,3,IF(R4=T4,1,0)))","v":""},{"$f":"IF(U4=\"\",\"\",IF(U4>W4,3,IF(U4=W4,1,0)))","v":""},{"$f":"IF(X4=\"\",\"\",IF(X4>Z4,3,IF(X4=Z4,1,0)))","v":""},{"$f":"IF(AA4=\"\",\"\",IF(AA4>AC4,3,IF(AA4=AC4,1,0)))","v":""},{"$f":"IF(AD4=\"\",\"\",IF(AD4>AF4,3,IF(AD4=AF4,1,0)))","v":""},{"$f":"IF(AG4=\"\",\"\",IF(AG4>AI4,3,IF(AG4=AI4,1,0)))","v":""},{"$f":"IF(AJ4=\"\",\"\",IF(AJ4>AL4,3,IF(AJ4=AL4,1,0)))","v":""},{"$f":"IF(AM4=\"\",\"\",IF(AM4>AO4,3,IF(AM4=AO4,1,0)))","v":""},{"$f":"IF(AP4=\"\",\"\",IF(AP4>AR4,3,IF(AP4=AR4,1,0)))","v":""},{"$f":"IF(AS4=\"\",\"\",IF(AS4>AU4,3,IF(AS4=AU4,1,0)))","v":""},{"$f":"IF(AV4=\"\",\"\",IF(AV4>AX4,3,IF(AV4=AX4,1,0)))","v":""},{"$f":"IF(AY4=\"\",\"\",IF(AY4>BA4,3,IF(AY4=BA4,1,0)))","v":""},{"$f":"IF(BB4=\"\",\"\",IF(BB4>BD4,3,IF(BB4=BD4,1,0)))","v":""},{"$f":"IF(BI4>BK4,\"aktivní\",IF(BI4=BK4,\"vyrovnané\",\"pasivní\"))","v":"vyrovnané"},{"$f":"IF(BL4>=80/100*BE4*3,\"vynikající\",IF(BL4<50/100*BE4*3,\"neúspěšné\",\"dobré\"))","v":"vynikající"}]
[2,{"$f":"'SKUPINA 3'!C6","v":"FK Meteor Praha"},{"$f":"IF(H4=\"\",\"\",H4)","v":""},":",{"$f":"IF(F4=\"\",\"\",F4)","v":""},null,null,null,null,":",null,null,":",null,null,":",null,null,":",null,null,":",null,null,":",null,null,":",null,null,":",null,null,":",null,null,":",null,null,":",null,null,":",null,null,":",null,null,":",null,null,":",null,null,":",null,{"$f":"COUNT(BM5:CC5)","v":0},{"$f":"COUNTIF(BM5:CC5,3)","v":0},{"$f":"COUNTIF(BM5:CC5,1)","v":0},{"$f":"COUNTIF(BM5:CC5,0)","v":0},{"$f":"SUM(C5,F5,I5,L5,O5,R5,U5,X5,AA5,AD5,AG5,AJ5,AM5,AP5,AS5,AV5,AY5,BB5)","v":0},":",{"$f":"SUM(E5,H5,K5,N5,Q5,T5,W5,Z5,AC5,AF5,AI5,AL5,AO5,AR5,AU5,AX5,BA5,BD5)","v":0},{"$f":"SUM(BM5:CC5)","v":0},{"$f":"IF(C5=\"\",\"\",IF(C5>E5,3,IF(C5=E5,1,0)))","v":""},{"$f":"IF(I5=\"\",\"\",IF(I5>K5,3,IF(I5=K5,1,0)))","v":""},{"$f":"IF(L5=\"\",\"\",IF(L5>N5,3,IF(L5=N5,1,0)))","v":""},{"$f":"IF(O5=\"\",\"\",IF(O5>Q5,3,IF(O5=Q5,1,0)))","v":""},{"$f":"IF(R5=\"\",\"\",IF(R5>T5,3,IF(R5=T5,1,0)))","v":""},"","","","","","","","","","",{"$f":"IF(AY5=\"\",\"\",IF(AY5>BA5,3,IF(AY5=BA5,1,0)))","v":""},{"$f":"IF(BB5=\"\",\"\",IF(BB5>BD5,3,IF(BB5=BD5,1,0)))","v":""},"vyrovnané","vynikající"]
[3,{"$f":"'SKUPINA 3'!C7","v":"FC Velké Meziříčí"},{"$f":"IF(K4=\"\",\"\",K4)","v":""},":",{"$f":"IF(I4=\"\",\"\",I4)","v":""},{"$f":"IF(K5=\"\",\"\",K5)","v":""},":",{"$f":"IF(I5=\"\",\"\",I5)","v":""},null,null,null,null,":",null,null,":",null,null,":",null,null,":",null,null,":",null,null,":",null,null,":",null,null,":",null,null,":",null,null,":",null,null,":",null,null,":",null,null,":",null,null,":",null,null,":",null,0,0,0,0,0,":",0,0,"",{"$f":"IF(F6=\"\",\"\",IF(F6>H6,3,IF(F6=H6,1,0)))","v":""},{"$f":"IF(L6=\"\",\"\",IF(L6>N6,3,IF(L6=N6,1,0)))","v":""},{"$f":"IF(O6=\"\",\"\",IF(O6>Q6,3,IF(O6=Q6,1,0)))","v":""},{"$f":"IF(R6=\"\",\"\",IF(R6>T6,3,IF(R6=T6,1,0)))","v":""},"","","","","","","","","","","","","vyrovnané","vynikající"]
[4,{"$f":"'SKUPINA 3'!C8","v":"FC Slovácko"},{"$f":"IF(N4=\"\",\"\",N4)","v":""},":",{"$f":"IF(L4=\"\",\"\",L4)","v":""},{"$f":"IF(N5=\"\",\"\",N5)","v":""},":",{"$f":"IF(L5=\"\",\"\",L5)","v":""},{"$f":"IF(N6=\"\",\"\",N6)","v":""},":",{"$f":"IF(L6=\"\",\"\",L6)","v":""},null,null,null,null,":",null,null,":",null,null,":",null,null,":",null,null,":",null,null,":",null,null,":",null,null,":",null,null,":",null,null,":",null,null,":",null,null,":",null,null,":",null,null,":",null,0,0,0,0,0,":",0,0,"","",{"$f":"IF(I7=\"\",\"\",IF(I7>K7,3,IF(I7=K7,1,0)))","v":""},{"$f":"IF(O7=\"\",\"\",IF(O7>Q7,3,IF(O7=Q7,1,0)))","v":""},{"$f":"IF(R7=\"\",\"\",IF(R7>T7,3,IF(R7=T7,1,0)))","v":""},"","","","","","","","","","","","","vyrovnané","vynikající"]
[5,{"$f":"'SKUPINA 3'!C9","v":5},{"$f":"IF(Q4=\"\",\"\",Q4)","v":""},":",{"$f":"IF(O4=\"\",\"\",O4)","v":""},{"$f":"IF(Q5=\"\",\"\",Q5)","v":""},":",{"$f":"IF(O5=\"\",\"\",O5)","v":""},{"$f":"IF(Q6=\"\",\"\",Q6)","v":""},":",{"$f":"IF(O6=\"\",\"\",O6)","v":""},{"$f":"IF(Q7=\"\",\"\",Q7)","v":""},":",{"$f":"IF(O7=\"\",\"\",O7)","v":""},null,null,null,null,":",null,null,":",null,null,":",null,null,":",null,null,":",null,null,":",null,null,":",null,null,":",null,null,":",null,null,":",null,null,":",null,null,":",null,null,":",null,0,0,0,0,0,":",0,0,"","","",{"$f":"IF(L8=\"\",\"\",IF(L8>N8,3,IF(L8=N8,1,0)))","v":""},{"$f":"IF(R8=\"\",\"\",IF(R8>T8,3,IF(R8=T8,1,0)))","v":""},"","","","","","","","","","","","","vyrovnané","vynikající"]
[6,{"$f":"'SKUPINA 3'!C10","v":6},{"$f":"IF(T4=\"\",\"\",T4)","v":""},":",{"$f":"IF(R4=\"\",\"\",R4)","v":""},{"$f":"IF(T5=\"\",\"\",T5)","v":""},":",{"$f":"IF(R5=\"\",\"\",R5)","v":""},{"$f":"IF(T6=\"\",\"\",T6)","v":""},":",{"$f":"IF(R6=\"\",\"\",R6)","v":""},{"$f":"IF(T7=\"\",\"\",T7)","v":""},":",{"$f":"IF(R7=\"\",\"\",R7)","v":""},{"$f":"IF(T8=\"\",\"\",T8)","v":""},":",{"$f":"IF(R8=\"\",\"\",R8)","v":""},null,null,null,null,":",null,null,":",null,null,":",null,null,":",null,null,":",null,null,":",null,null,":",null,null,":",null,null,":",null,null,":",null,null,":",null,null,":",null,0,0,0,0,0,":",0,0,"","","","",{"$f":"IF(O9=\"\",\"\",IF(O9>Q9,3,IF(O9=Q9,1,0)))","v":""},"","","","","","","","","","","","","vyrovnané","vynikající"]
[7,{"$f":"'SKUPINA 3'!C11","v":7},{"$f":"IF(W4=\"\",\"\",W4)","v":""},":",{"$f":"IF(U4=\"\",\"\",U4)","v":""},{"$f":"IF(W5=\"\",\"\",W5)","v":""},":",{"$f":"IF(U5=\"\",\"\",U5)","v":""},{"$f":"IF(W6=\"\",\"\",W6)","v":""},":",{"$f":"IF(U6=\"\",\"\",U6)","v":""},{"$f":"IF(W7=\"\",\"\",W7)","v":""},":",{"$f":"IF(U7=\"\",\"\",U7)","v":""},{"$f":"IF(W8=\"\",\"\",W8)","v":""},":",{"$f":"IF(U8=\"\",\"\",U8)","v":""},{"$f":"IF(W9=\"\",\"\",W9)","v":""},":",{"$f":"IF(U9=\"\",\"\",U9)","v":""},null,null,null,null,":",null,null,":",null,null,":",null,null,":",null,null,":",null,null,":",null,null,":",null,null,":",null,null,":",null,null,":",null,null,":",null,0,0,0,0,0,":",0,0,"","","","","",{"$f":"IF(R10=\"\",\"\",IF(R10>T10,3,IF(R10=T10,1,0)))","v":""},"","","","","","","","","","","","vyrovnané","vynikající"]
[8,{"$f":"'SKUPINA 3'!C12","v":8},{"$f":"IF(Z4=\"\",\"\",Z4)","v":""},":",{"$f":"IF(X4=\"\",\"\",X4)","v":""},{"$f":"IF(Z5=\"\",\"\",Z5)","v":""},":",{"$f":"IF(X5=\"\",\"\",X5)","v":""},{"$f":"IF(Z6=\"\",\"\",Z6)","v":""},":",{"$f":"IF(X6=\"\",\"\",X6)","v":""},{"$f":"IF(Z7=\"\",\"\",Z7)","v":""},":",{"$f":"IF(X7=\"\",\"\",X7)","v":""},{"$f":"IF(Z8=\"\",\"\",Z8)","v":""},":",{"$f":"IF(X8=\"\",\"\",X8)","v":""},{"$f":"IF(Z9=\"\",\"\",Z9)","v":""},":",{"$f":"IF(X9=\"\",\"\",X9)","v":""},{"$f":"IF(Z10=\"\",\"\",Z10)","v":""},":",{"$f":"IF(X10=\"\",\"\",X10)","v":""},null,null,null,null,":",null,null,":",null,null,":",null,null,":",null,null,":",null,null,":",null,null,":",null,null,":",null,null,":",null,null,":",null,0,0,0,0,0,":",0,0,"","","","","","",{"$f":"IF(U11=\"\",\"\",IF(U11>W11,3,IF(U11=W11,1,0)))","v":""},"","","","","","","","","","","vyrovnané","vynikající"]
[9,{"$f":"'SKUPINA 3'!C13","v":9},{"$f":"IF(AC4=\"\",\"\",AC4)","v":""},":",{"$f":"IF(AA4=\"\",\"\",AA4)","v":""},{"$f":"IF(AC5=\"\",\"\",AC5)","v":""},":",{"$f":"IF(AA5=\"\",\"\",AA5)","v":""},{"$f":"IF(AC6=\"\",\"\",AC6)","v":""},":",{"$f":"IF(AA6=\"\",\"\",AA6)","v":""},{"$f":"IF(AC7=\"\",\"\",AC7)","v":""},":",{"$f":"IF(AA7=\"\",\"\",AA7)","v":""},{"$f":"IF(AC8=\"\",\"\",AC8)","v":""},":",{"$f":"IF(AA8=\"\",\"\",AA8)","v":""},{"$f":"IF(AC9=\"\",\"\",AC9)","v":""},":",{"$f":"IF(AA9=\"\",\"\",AA9)","v":""},{"$f":"IF(AC10=\"\",\"\",AC10)","v":""},":",{"$f":"IF(AA10=\"\",\"\",AA10)","v":""},{"$f":"IF(AC11=\"\",\"\",AC11)","v":""},":",{"$f":"IF(AA11=\"\",\"\",AA11)","v":""},null,null,null,null,":",null,null,":",null,null,":",null,null,":",null,null,":",null,null,":",null,null,":",null,null,":",null,null,":",null,0,0,0,0,0,":",0,0,"","","","","","","",{"$f":"IF(X12=\"\",\"\",IF(X12>Z12,3,IF(X12=Z12,1,0)))","v":""},"","","","","","","","","","vyrovnané","vynikající"]
[10,{"$f":"'SKUPINA 3'!C14","v":10},{"$f":"IF(AF4=\"\",\"\",AF4)","v":""},":",{"$f":"IF(AD4=\"\",\"\",AD4)","v":""},{"$f":"IF(AF5=\"\",\"\",AF5)","v":""},":",{"$f":"IF(AD5=\"\",\"\",AD5)","v":""},{"$f":"IF(AF6=\"\",\"\",AF6)","v":""},":",{"$f":"IF(AD6=\"\",\"\",AD6)","v":""},{"$f":"IF(AF7=\"\",\"\",AF7)","v":""},":",{"$f":"IF(AD7=\"\",\"\",AD7)","v":""},{"$f":"IF(AF8=\"\",\"\",AF8)","v":""},":",{"$f":"IF(AD8=\"\",\"\",AD8)","v":""},{"$f":"IF(AF9=\"\",\"\",AF9)","v":""},":",{"$f":"IF(AD9=\"\",\"\",AD9)","v":""},{"$f":"IF(AF10=\"\",\"\",AF10)","v":""},":",{"$f":"IF(AD10=\"\",\"\",AD10)","v":""},{"$f":"IF(AF11=\"\",\"\",AF11)","v":""},":",{"$f":"IF(AD11=\"\",\"\",AD11)","v":""},{"$f":"IF(AF12=\"\",\"\",AF12)","v":""},":",{"$f":"IF(AD12=\"\",\"\",AD12)","v":""},null,null,null,null,":",null,null,":",null,null,":",null,null,":",null,null,":",null,null,":",null,null,":",null,null,":",null,0,0,0,0,0,":",0,0,"","","","","","","","",{"$f":"IF(AA13=\"\",\"\",IF(AA13>AC13,3,IF(AA13=AC13,1,0)))","v":""},"","","","","","","","","vyrovnané","vynikající"]
[11,{"$f":"'SKUPINA 3'!#REF!","v":{"$error":"#REF!"}},{"$f":"IF(AI4=\"\",\"\",AI4)","v":""},":",{"$f":"IF(AG4=\"\",\"\",AG4)","v":""},{"$f":"IF(AI5=\"\",\"\",AI5)","v":""},":",{"$f":"IF(AG5=\"\",\"\",AG5)","v":""},{"$f":"IF(AI6=\"\",\"\",AI6)","v":""},":",{"$f":"IF(AG6=\"\",\"\",AG6)","v":""},{"$f":"IF(AI7=\"\",\"\",AI7)","v":""},":",{"$f":"IF(AG7=\"\",\"\",AG7)","v":""},{"$f":"IF(AI8=\"\",\"\",AI8)","v":""},":",{"$f":"IF(AG8=\"\",\"\",AG8)","v":""},{"$f":"IF(AI9=\"\",\"\",AI9)","v":""},":",{"$f":"IF(AG9=\"\",\"\",AG9)","v":""},{"$f":"IF(AI10=\"\",\"\",AI10)","v":""},":",{"$f":"IF(AG10=\"\",\"\",AG10)","v":""},{"$f":"IF(AI11=\"\",\"\",AI11)","v":""},":",{"$f":"IF(AG11=\"\",\"\",AG11)","v":""},{"$f":"IF(AI12=\"\",\"\",AI12)","v":""},":",{"$f":"IF(AG12=\"\",\"\",AG12)","v":""},{"$f":"IF(AI13=\"\",\"\",AI13)","v":""},":",{"$f":"IF(AG13=\"\",\"\",AG13)","v":""},null,null,null,null,":",null,null,":",null,null,":",null,null,":",null,null,":",null,null,":",null,null,":",null,0,0,0,0,0,":",0,0,"","","","","","","","","",{"$f":"IF(AD14=\"\",\"\",IF(AD14>AF14,3,IF(AD14=AF14,1,0)))","v":""},"","","","","","","","vyrovnané","vynikající"]
[12,{"$f":"'SKUPINA 3'!#REF!","v":{"$error":"#REF!"}},{"$f":"IF(AL4=\"\",\"\",AL4)","v":""},":",{"$f":"IF(AJ4=\"\",\"\",AJ4)","v":""},{"$f":"IF(AL5=\"\",\"\",AL5)","v":""},":",{"$f":"IF(AJ5=\"\",\"\",AJ5)","v":""},{"$f":"IF(AL6=\"\",\"\",AL6)","v":""},":",{"$f":"IF(AJ6=\"\",\"\",AJ6)","v":""},{"$f":"IF(AL7=\"\",\"\",AL7)","v":""},":",{"$f":"IF(AJ7=\"\",\"\",AJ7)","v":""},{"$f":"IF(AL8=\"\",\"\",AL8)","v":""},":",{"$f":"IF(AJ8=\"\",\"\",AJ8)","v":""},{"$f":"IF(AL9=\"\",\"\",AL9)","v":""},":",{"$f":"IF(AJ9=\"\",\"\",AJ9)","v":""},{"$f":"IF(AL10=\"\",\"\",AL10)","v":""},":",{"$f":"IF(AJ10=\"\",\"\",AJ10)","v":""},{"$f":"IF(AL11=\"\",\"\",AL11)","v":""},":",{"$f":"IF(AJ11=\"\",\"\",AJ11)","v":""},{"$f":"IF(AL12=\"\",\"\",AL12)","v":""},":",{"$f":"IF(AJ12=\"\",\"\",AJ12)","v":""},{"$f":"IF(AL13=\"\",\"\",AL13)","v":""},":",{"$f":"IF(AJ13=\"\",\"\",AJ13)","v":""},{"$f":"IF(AL14=\"\",\"\",AL14)","v":""},":",{"$f":"IF(AJ14=\"\",\"\",AJ14)","v":""},null,null,null,null,":",null,null,":",null,null,":",null,null,":",null,null,":",null,null,":",null,0,0,0,0,0,":",0,0,"","","","","","","","","","",{"$f":"IF(AG15=\"\",\"\",IF(AG15>AI15,3,IF(AG15=AI15,1,0)))","v":""},"","","","","","","vyrovnané","vynikající"]
[13,{"$f":"'SKUPINA 3'!#REF!","v":{"$error":"#REF!"}},{"$f":"IF(AO4=\"\",\"\",AO4)","v":""},":",{"$f":"IF(AM4=\"\",\"\",AM4)","v":""},{"$f":"IF(AO5=\"\",\"\",AO5)","v":""},":",{"$f":"IF(AM5=\"\",\"\",AM5)","v":""},{"$f":"IF(AO6=\"\",\"\",AO6)","v":""},":",{"$f":"IF(AM6=\"\",\"\",AM6)","v":""},{"$f":"IF(AO7=\"\",\"\",AO7)","v":""},":",{"$f":"IF(AM7=\"\",\"\",AM7)","v":""},{"$f":"IF(AO8=\"\",\"\",AO8)","v":""},":",{"$f":"IF(AM8=\"\",\"\",AM8)","v":""},{"$f":"IF(AO9=\"\",\"\",AO9)","v":""},":",{"$f":"IF(AM9=\"\",\"\",AM9)","v":""},{"$f":"IF(AO10=\"\",\"\",AO10)","v":""},":",{"$f":"IF(AM10=\"\",\"\",AM10)","v":""},{"$f":"IF(AO11=\"\",\"\",AO11)","v":""},":",{"$f":"IF(AM11=\"\",\"\",AM11)","v":""},{"$f":"IF(AO12=\"\",\"\",AO12)","v":""},":",{"$f":"IF(AM12=\"\",\"\",AM12)","v":""},{"$f":"IF(AO13=\"\",\"\",AO13)","v":""},":",{"$f":"IF(AM13=\"\",\"\",AM13)","v":""},{"$f":"IF(AO14=\"\",\"\",AO14)","v":""},":",{"$f":"IF(AM14=\"\",\"\",AM14)","v":""},{"$f":"IF(AO15=\"\",\"\",AO15)","v":""},":",{"$f":"IF(AM15=\"\",\"\",AM15)","v":""},null,null,null,null,":",null,null,":",null,null,":",null,null,":",null,null,":",null,0,0,0,0,0,":",0,0,"","","","","","","","","","","",{"$f":"IF(AJ16=\"\",\"\",IF(AJ16>AL16,3,IF(AJ16=AL16,1,0)))","v":""},"","","","","","vyrovnané","vynikající"]
[14,{"$f":"'SKUPINA 3'!#REF!","v":{"$error":"#REF!"}},{"$f":"IF(AR4=\"\",\"\",AR4)","v":""},":",{"$f":"IF(AP4=\"\",\"\",AP4)","v":""},{"$f":"IF(AR5=\"\",\"\",AR5)","v":""},":",{"$f":"IF(AP5=\"\",\"\",AP5)","v":""},{"$f":"IF(AR6=\"\",\"\",AR6)","v":""},":",{"$f":"IF(AP6=\"\",\"\",AP6)","v":""},{"$f":"IF(AR7=\"\",\"\",AR7)","v":""},":",{"$f":"IF(AP7=\"\",\"\",AP7)","v":""},{"$f":"IF(AR8=\"\",\"\",AR8)","v":""},":",{"$f":"IF(AP8=\"\",\"\",AP8)","v":""},{"$f":"IF(AR9=\"\",\"\",AR9)","v":""},":",{"$f":"IF(AP9=\"\",\"\",AP9)","v":""},{"$f":"IF(AR10=\"\",\"\",AR10)","v":""},":",{"$f":"IF(AP10=\"\",\"\",AP10)","v":""},{"$f":"IF(AR11=\"\",\"\",AR11)","v":""},":",{"$f":"IF(AP11=\"\",\"\",AP11)","v":""},{"$f":"IF(AR12=\"\",\"\",AR12)","v":""},":",{"$f":"IF(AP12=\"\",\"\",AP12)","v":""},{"$f":"IF(AR13=\"\",\"\",AR13)","v":""},":",{"$f":"IF(AP13=\"\",\"\",AP13)","v":""},{"$f":"IF(AR14=\"\",\"\",AR14)","v":""},":",{"$f":"IF(AP14=\"\",\"\",AP14)","v":""},{"$f":"IF(AR15=\"\",\"\",AR15)","v":""},":",{"$f":"IF(AP15=\"\",\"\",AP15)","v":""},{"$f":"IF(AR16=\"\",\"\",AR16)","v":""},":",{"$f":"IF(AP16=\"\",\"\",AP16)","v":""},null,null,null,null,":",null,null,":",null,null,":",null,null,":",null,0,0,0,0,0,":",0,0,"","","","","","","","","","","","",{"$f":"IF(AM17=\"\",\"\",IF(AM17>AO17,3,IF(AM17=AO17,1,0)))","v":""},"","","","","vyrovnané","vynikající"]
[15,{"$f":"'SKUPINA 3'!C15","v":11},{"$f":"IF(AU4=\"\",\"\",AU4)","v":""},":",{"$f":"IF(AS4=\"\",\"\",AS4)","v":""},{"$f":"IF(AU5=\"\",\"\",AU5)","v":""},":",{"$f":"IF(AS5=\"\",\"\",AS5)","v":""},{"$f":"IF(AU6=\"\",\"\",AU6)","v":""},":",{"$f":"IF(AS6=\"\",\"\",AS6)","v":""},{"$f":"IF(AU7=\"\",\"\",AU7)","v":""},":",{"$f":"IF(AS7=\"\",\"\",AS7)","v":""},{"$f":"IF(AU8=\"\",\"\",AU8)","v":""},":",{"$f":"IF(AS8=\"\",\"\",AS8)","v":""},{"$f":"IF(AU9=\"\",\"\",AU9)","v":""},":",{"$f":"IF(AS9=\"\",\"\",AS9)","v":""},{"$f":"IF(AU10=\"\",\"\",AU10)","v":""},":",{"$f":"IF(AS10=\"\",\"\",AS10)","v":""},{"$f":"IF(AU11=\"\",\"\",AU11)","v":""},":",{"$f":"IF(AS11=\"\",\"\",AS11)","v":""},{"$f":"IF(AU12=\"\",\"\",AU12)","v":""},":",{"$f":"IF(AS12=\"\",\"\",AS12)","v":""},{"$f":"IF(AU13=\"\",\"\",AU13)","v":""},":",{"$f":"IF(AS13=\"\",\"\",AS13)","v":""},{"$f":"IF(AU14=\"\",\"\",AU14)","v":""},":",{"$f":"IF(AS14=\"\",\"\",AS14)","v":""},{"$f":"IF(AU15=\"\",\"\",AU15)","v":""},":",{"$f":"IF(AS15=\"\",\"\",AS15)","v":""},{"$f":"IF(AU16=\"\",\"\",AU16)","v":""},":",{"$f":"IF(AS16=\"\",\"\",AS16)","v":""},{"$f":"IF(AU17=\"\",\"\",AU17)","v":""},":",{"$f":"IF(AS17=\"\",\"\",AS17)","v":""},null,null,null,null,":",null,null,":",null,null,":",null,0,0,0,0,0,":",0,0,"","","","","","","","","","","","",{"$f":"IF(AM18=\"\",\"\",IF(AM18>AO18,3,IF(AM18=AO18,1,0)))","v":""},{"$f":"IF(AP18=\"\",\"\",IF(AP18>AR18,3,IF(AP18=AR18,1,0)))","v":""},"","","","vyrovnané","vynikající"]
[16,{"$f":"'SKUPINA 3'!C16","v":12},{"$f":"IF(AX4=\"\",\"\",AX4)","v":""},":",{"$f":"IF(AV4=\"\",\"\",AV4)","v":""},{"$f":"IF(AX5=\"\",\"\",AX5)","v":""},":",{"$f":"IF(AV5=\"\",\"\",AV5)","v":""},{"$f":"IF(AX6=\"\",\"\",AX6)","v":""},":",{"$f":"IF(AV6=\"\",\"\",AV6)","v":""},{"$f":"IF(AX7=\"\",\"\",AX7)","v":""},":",{"$f":"IF(AV7=\"\",\"\",AV7)","v":""},{"$f":"IF(AX8=\"\",\"\",AX8)","v":""},":",{"$f":"IF(AV8=\"\",\"\",AV8)","v":""},{"$f":"IF(AX9=\"\",\"\",AX9)","v":""},":",{"$f":"IF(AV9=\"\",\"\",AV9)","v":""},{"$f":"IF(AX10=\"\",\"\",AX10)","v":""},":",{"$f":"IF(AV10=\"\",\"\",AV10)","v":""},{"$f":"IF(AX11=\"\",\"\",AX11)","v":""},":",{"$f":"IF(AV11=\"\",\"\",AV11)","v":""},{"$f":"IF(AX12=\"\",\"\",AX12)","v":""},":",{"$f":"IF(AV12=\"\",\"\",AV12)","v":""},{"$f":"IF(AX13=\"\",\"\",AX13)","v":""},":",{"$f":"IF(AV13=\"\",\"\",AV13)","v":""},{"$f":"IF(AX14=\"\",\"\",AX14)","v":""},":",{"$f":"IF(AV14=\"\",\"\",AV14)","v":""},{"$f":"IF(AX15=\"\",\"\",AX15)","v":""},":",{"$f":"IF(AV15=\"\",\"\",AV15)","v":""},{"$f":"IF(AX16=\"\",\"\",AX16)","v":""},":",{"$f":"IF(AV16=\"\",\"\",AV16)","v":""},{"$f":"IF(AX17=\"\",\"\",AX17)","v":""},":",{"$f":"IF(AV17=\"\",\"\",AV17)","v":""},{"$f":"IF(AX18=\"\",\"\",AX18)","v":""},":",{"$f":"IF(AV18=\"\",\"\",AV18)","v":""},null,null,null,null,":",null,null,":",null,0,0,0,0,0,":",0,0,"","","","","","","","","","","","",{"$f":"IF(AM19=\"\",\"\",IF(AM19>AO19,3,IF(AM19=AO19,1,0)))","v":""},{"$f":"IF(AP19=\"\",\"\",IF(AP19>AR19,3,IF(AP19=AR19,1,0)))","v":""},{"$f":"IF(AS19=\"\",\"\",IF(AS19>AU19,3,IF(AS19=AU19,1,0)))","v":""},"","","vyrovnané","vynikající"]
[17,{"$f":"'SKUPINA 3'!C17","v":13},{"$f":"IF(BA4=\"\",\"\",BA4)","v":""},":",{"$f":"IF(AY4=\"\",\"\",AY4)","v":""},{"$f":"IF(BA5=\"\",\"\",BA5)","v":""},":",{"$f":"IF(AY5=\"\",\"\",AY5)","v":""},{"$f":"IF(BA6=\"\",\"\",BA6)","v":""},":",{"$f":"IF(AY6=\"\",\"\",AY6)","v":""},{"$f":"IF(BA7=\"\",\"\",BA7)","v":""},":",{"$f":"IF(AY7=\"\",\"\",AY7)","v":""},{"$f":"IF(BA8=\"\",\"\",BA8)","v":""},":",{"$f":"IF(AY8=\"\",\"\",AY8)","v":""},{"$f":"IF(BA9=\"\",\"\",BA9)","v":""},":",{"$f":"IF(AY9=\"\",\"\",AY9)","v":""},{"$f":"IF(BA10=\"\",\"\",BA10)","v":""},":",{"$f":"IF(AY10=\"\",\"\",AY10)","v":""},{"$f":"IF(BA11=\"\",\"\",BA11)","v":""},":",{"$f":"IF(AY11=\"\",\"\",AY11)","v":""},{"$f":"IF(BA12=\"\",\"\",BA12)","v":""},":",{"$f":"IF(AY12=\"\",\"\",AY12)","v":""},{"$f":"IF(BA13=\"\",\"\",BA13)","v":""},":",{"$f":"IF(AY13=\"\",\"\",AY13)","v":""},{"$f":"IF(BA14=\"\",\"\",BA14)","v":""},":",{"$f":"IF(AY14=\"\",\"\",AY14)","v":""},{"$f":"IF(BA15=\"\",\"\",BA15)","v":""},":",{"$f":"IF(AY15=\"\",\"\",AY15)","v":""},{"$f":"IF(BA16=\"\",\"\",BA16)","v":""},":",{"$f":"IF(AY16=\"\",\"\",AY16)","v":""},{"$f":"IF(BA17=\"\",\"\",BA17)","v":""},":",{"$f":"IF(AY17=\"\",\"\",AY17)","v":""},{"$f":"IF(BA18=\"\",\"\",BA18)","v":""},":",{"$f":"IF(AY18=\"\",\"\",AY18)","v":""},{"$f":"IF(BA19=\"\",\"\",BA19)","v":""},":",{"$f":"IF(AY19=\"\",\"\",AY19)","v":""},null,null,null,null,":",null,0,0,0,0,0,":",0,0,{"$f":"IF(C20=\"\",\"\",IF(C20>E20,3,IF(C20=E20,1,0)))","v":""},{"$f":"IF(F20=\"\",\"\",IF(F20>H20,3,IF(F20=H20,1,0)))","v":""},{"$f":"IF(I20=\"\",\"\",IF(I20>K20,3,IF(I20=K20,1,0)))","v":""},{"$f":"IF(L20=\"\",\"\",IF(L20>N20,3,IF(L20=N20,1,0)))","v":""},{"$f":"IF(O20=\"\",\"\",IF(O20>Q20,3,IF(O20=Q20,1,0)))","v":""},{"$f":"IF(R20=\"\",\"\",IF(R20>T20,3,IF(R20=T20,1,0)))","v":""},{"$f":"IF(U20=\"\",\"\",IF(U20>W20,3,IF(U20=W20,1,0)))","v":""},{"$f":"IF(X20=\"\",\"\",IF(X20>Z20,3,IF(X20=Z20,1,0)))","v":""},{"$f":"IF(AA20=\"\",\"\",IF(AA20>AC20,3,IF(AA20=AC20,1,0)))","v":""},{"$f":"IF(AD20=\"\",\"\",IF(AD20>AF20,3,IF(AD20=AF20,1,0)))","v":""},"","",{"$f":"IF(AM20=\"\",\"\",IF(AM20>AO20,3,IF(AM20=AO20,1,0)))","v":""},{"$f":"IF(AP20=\"\",\"\",IF(AP20>AR20,3,IF(AP20=AR20,1,0)))","v":""},{"$f":"IF(AS20=\"\",\"\",IF(AS20>AU20,3,IF(AS20=AU20,1,0)))","v":""},{"$f":"IF(AV20=\"\",\"\",IF(AV20>BB20,3,IF(AV20=BB20,1,0)))","v":""},"",{"$f":"IF(BI20>BK20,\"aktivní\",IF(BI20=BK20,\"vyrovnané\",\"pasivní\"))","v":"vyrovnané"},{"$f":"IF(BL20>=80/100*BE20*3,\"vynikající\",IF(BL20<50/100*BE20*3,\"neúspěšné\",\"dobré\"))","v":"vynikající"}]
[18,{"$f":"'SKUPINA 3'!C18","v":14},{"$f":"IF(BD4=\"\",\"\",BD4)","v":""},":",{"$f":"IF(BB4=\"\",\"\",BB4)","v":""},{"$f":"IF(BD5=\"\",\"\",BD5)","v":""},":",{"$f":"IF(BB5=\"\",\"\",BB5)","v":""},{"$f":"IF(BD6=\"\",\"\",BD6)","v":""},":",{"$f":"IF(BB6=\"\",\"\",BB6)","v":""},{"$f":"IF(BD7=\"\",\"\",BD7)","v":""},":",{"$f":"IF(BB7=\"\",\"\",BB7)","v":""},{"$f":"IF(BD8=\"\",\"\",BD8)","v":""},":",{"$f":"IF(BB8=\"\",\"\",BB8)","v":""},{"$f":"IF(BD9=\"\",\"\",BD9)","v":""},":",{"$f":"IF(BB9=\"\",\"\",BB9)","v":""},{"$f":"IF(BD10=\"\",\"\",BD10)","v":""},":",{"$f":"IF(BB10=\"\",\"\",BB10)","v":""},{"$f":"IF(BD11=\"\",\"\",BD11)","v":""},":",{"$f":"IF(BB11=\"\",\"\",BB11)","v":""},{"$f":"IF(BD12=\"\",\"\",BD12)","v":""},":",{"$f":"IF(BB12=\"\",\"\",BB12)","v":""},{"$f":"IF(BD13=\"\",\"\",BD13)","v":""},":",{"$f":"IF(BB13=\"\",\"\",BB13)","v":""},{"$f":"IF(BD14=\"\",\"\",BD14)","v":""},":",{"$f":"IF(BB14=\"\",\"\",BB14)","v":""},{"$f":"IF(BD15=\"\",\"\",BD15)","v":""},":",{"$f":"IF(BB15=\"\",\"\",BB15)","v":""},{"$f":"IF(BD16=\"\",\"\",BD16)","v":""},":",{"$f":"IF(BB16=\"\",\"\",BB16)","v":""},{"$f":"IF(BD17=\"\",\"\",BD17)","v":""},":",{"$f":"IF(BB17=\"\",\"\",BB17)","v":""},{"$f":"IF(BD18=\"\",\"\",BD18)","v":""},":",{"$f":"IF(BB18=\"\",\"\",BB18)","v":""},{"$f":"IF(BD19=\"\",\"\",BD19)","v":""},":",{"$f":"IF(BB19=\"\",\"\",BB19)","v":""},{"$f":"IF(BD20=\"\",\"\",BD20)","v":""},":",{"$f":"IF(BB20=\"\",\"\",BB20)","v":""},null,null,null,0,0,0,0,0,":",0,0,{"$f":"IF(C21=\"\",\"\",IF(C21>E21,3,IF(C21=E21,1,0)))","v":""},{"$f":"IF(F21=\"\",\"\",IF(F21>H21,3,IF(F21=H21,1,0)))","v":""},{"$f":"IF(I21=\"\",\"\",IF(I21>K21,3,IF(I21=K21,1,0)))","v":""},{"$f":"IF(L21=\"\",\"\",IF(L21>N21,3,IF(L21=N21,1,0)))","v":""},{"$f":"IF(O21=\"\",\"\",IF(O21>Q21,3,IF(O21=Q21,1,0)))","v":""},{"$f":"IF(R21=\"\",\"\",IF(R21>T21,3,IF(R21=T21,1,0)))","v":""},{"$f":"IF(U21=\"\",\"\",IF(U21>W21,3,IF(U21=W21,1,0)))","v":""},{"$f":"IF(X21=\"\",\"\",IF(X21>Z21,3,IF(X21=Z21,1,0)))","v":""},{"$f":"IF(AA21=\"\",\"\",IF(AA21>AC21,3,IF(AA21=AC21,1,0)))","v":""},{"$f":"IF(AD21=\"\",\"\",IF(AD21>AF21,3,IF(AD21=AF21,1,0)))","v":""},"","",{"$f":"IF(AM21=\"\",\"\",IF(AM21>AO21,3,IF(AM21=AO21,1,0)))","v":""},{"$f":"IF(AP21=\"\",\"\",IF(AP21>AR21,3,IF(AP21=AR21,1,0)))","v":""},{"$f":"IF(AS21=\"\",\"\",IF(AS21>AU21,3,IF(AS21=AU21,1,0)))","v":""},{"$f":"IF(AV21=\"\",\"\",IF(AV21>BB21,3,IF(AV21=BB21,1,0)))","v":""},{"$f":"IF(AY21=\"\",\"\",IF(AY21>BA21,3,IF(AY21=BB21,1,0)))","v":""},{"$f":"IF(BI21>BK21,\"aktivní\",IF(BI21=BK21,\"vyrovnané\",\"pasivní\"))","v":"vyrovnané"},{"$f":"IF(BL21>=80/100*BE21*3,\"vynikající\",IF(BL21<50/100*BE21*3,\"neúspěšné\",\"dobré\"))","v":"vynikající"}]

{"sheet":"Jaro - pořadí","index":2,"n_rows":20,"n_cols":13,"rows_kept":20,"cut":false,"hidden":true,"merged":[]}
[null,{"$f":"'SKUPINA 3'!$A$1","v":"SKUPINA 3 hlavního turnaje v kategorii U9"}]
[null,null,"Utkání celkem","Vítězství","Remízy","Prohry","Skóre",null,null,"Rozdíl","Body","Hodnocení skóre","Hodnocení družstva"]
[1,{"$f":"'SKUPINA 3'!C5","v":"1.SK Prostějov"},{"$f":"Jaro!BE4","v":0},{"$f":"Jaro!BF4","v":0},{"$f":"Jaro!BG4","v":0},{"$f":"Jaro!BH4","v":0},{"$f":"Jaro!BI4","v":0},":",{"$f":"Jaro!BK4","v":0},{"$f":"SUM(G3-I3)","v":0},{"$f":"Jaro!BL4","v":0},{"$f":"IF(G3>I3,\"aktivní\",IF(G3=I3,\"vyrovnané\",\"pasivní\"))","v":"vyrovnané"},{"$f":"IF(K3>=80/100*C3*3,\"vynikající\",IF(K3<50/100*C3*3,\"neúspěšné\",\"dobré\"))","v":"vynikající"}]
[2,{"$f":"'SKUPINA 3'!C6","v":"FK Meteor Praha"},{"$f":"Jaro!BE5","v":0},{"$f":"Jaro!BF5","v":0},{"$f":"Jaro!BG5","v":0},{"$f":"Jaro!BH5","v":0},{"$f":"Jaro!BI5","v":0},":",{"$f":"Jaro!BK5","v":0},{"$f":"SUM(G4-I4)","v":0},{"$f":"Jaro!BL5","v":0},"vyrovnané","vynikající"]
[3,{"$f":"'SKUPINA 3'!C7","v":"FC Velké Meziříčí"},{"$f":"Jaro!BE6","v":0},{"$f":"Jaro!BF6","v":0},{"$f":"Jaro!BG6","v":0},{"$f":"Jaro!BH6","v":0},{"$f":"Jaro!BI6","v":0},":",{"$f":"Jaro!BK6","v":0},0,{"$f":"Jaro!BL6","v":0},"vyrovnané","vynikající"]
[4,{"$f":"'SKUPINA 3'!C8","v":"FC Slovácko"},{"$f":"Jaro!BE7","v":0},{"$f":"Jaro!BF7","v":0},{"$f":"Jaro!BG7","v":0},{"$f":"Jaro!BH7","v":0},{"$f":"Jaro!BI7","v":0},":",{"$f":"Jaro!BK7","v":0},0,{"$f":"Jaro!BL7","v":0},"vyrovnané","vynikající"]
[5,{"$f":"'SKUPINA 3'!C9","v":5},{"$f":"Jaro!BE8","v":0},{"$f":"Jaro!BF8","v":0},{"$f":"Jaro!BG8","v":0},{"$f":"Jaro!BH8","v":0},{"$f":"Jaro!BI8","v":0},":",{"$f":"Jaro!BK8","v":0},0,{"$f":"Jaro!BL8","v":0},"vyrovnané","vynikající"]
[6,{"$f":"'SKUPINA 3'!C10","v":6},{"$f":"Jaro!BE9","v":0},{"$f":"Jaro!BF9","v":0},{"$f":"Jaro!BG9","v":0},{"$f":"Jaro!BH9","v":0},{"$f":"Jaro!BI9","v":0},":",{"$f":"Jaro!BK9","v":0},0,{"$f":"Jaro!BL9","v":0},"vyrovnané","vynikající"]
[7,{"$f":"'SKUPINA 3'!C11","v":7},{"$f":"Jaro!BE10","v":0},{"$f":"Jaro!BF10","v":0},{"$f":"Jaro!BG10","v":0},{"$f":"Jaro!BH10","v":0},{"$f":"Jaro!BI10","v":0},":",{"$f":"Jaro!BK10","v":0},0,{"$f":"Jaro!BL10","v":0},"vyrovnané","vynikající"]
[8,{"$f":"'SKUPINA 3'!C12","v":8},{"$f":"Jaro!BE11","v":0},{"$f":"Jaro!BF11","v":0},{"$f":"Jaro!BG11","v":0},{"$f":"Jaro!BH11","v":0},{"$f":"Jaro!BI11","v":0},":",{"$f":"Jaro!BK11","v":0},0,{"$f":"Jaro!BL11","v":0},"vyrovnané","vynikající"]
[9,{"$f":"'SKUPINA 3'!C13","v":9},{"$f":"Jaro!BE12","v":0},{"$f":"Jaro!BF12","v":0},{"$f":"Jaro!BG12","v":0},{"$f":"Jaro!BH12","v":0},{"$f":"Jaro!BI12","v":0},":",{"$f":"Jaro!BK12","v":0},0,{"$f":"Jaro!BL12","v":0},"vyrovnané","vynikající"]
[10,{"$f":"'SKUPINA 3'!C14","v":10},{"$f":"Jaro!BE13","v":0},{"$f":"Jaro!BF13","v":0},{"$f":"Jaro!BG13","v":0},{"$f":"Jaro!BH13","v":0},{"$f":"Jaro!BI13","v":0},":",{"$f":"Jaro!BK13","v":0},0,{"$f":"Jaro!BL13","v":0},"vyrovnané","vynikající"]
[11,{"$f":"'SKUPINA 3'!#REF!","v":{"$error":"#REF!"}},{"$f":"Jaro!BE14","v":0},{"$f":"Jaro!BF14","v":0},{"$f":"Jaro!BG14","v":0},{"$f":"Jaro!BH14","v":0},{"$f":"Jaro!BI14","v":0},":",{"$f":"Jaro!BK14","v":0},0,{"$f":"Jaro!BL14","v":0},"vyrovnané","vynikající"]
[12,{"$f":"'SKUPINA 3'!#REF!","v":{"$error":"#REF!"}},{"$f":"Jaro!BE15","v":0},{"$f":"Jaro!BF15","v":0},{"$f":"Jaro!BG15","v":0},{"$f":"Jaro!BH15","v":0},{"$f":"Jaro!BI15","v":0},":",{"$f":"Jaro!BK15","v":0},0,{"$f":"Jaro!BL15","v":0},"vyrovnané","vynikající"]
[13,{"$f":"'SKUPINA 3'!#REF!","v":{"$error":"#REF!"}},{"$f":"Jaro!BE16","v":0},{"$f":"Jaro!BF16","v":0},{"$f":"Jaro!BG16","v":0},{"$f":"Jaro!BH16","v":0},{"$f":"Jaro!BI16","v":0},":",{"$f":"Jaro!BK16","v":0},0,{"$f":"Jaro!BL16","v":0},"vyrovnané","vynikající"]
[14,{"$f":"'SKUPINA 3'!#REF!","v":{"$error":"#REF!"}},{"$f":"Jaro!BE17","v":0},{"$f":"Jaro!BF17","v":0},{"$f":"Jaro!BG17","v":0},{"$f":"Jaro!BH17","v":0},{"$f":"Jaro!BI17","v":0},":",{"$f":"Jaro!BK17","v":0},0,{"$f":"Jaro!BL17","v":0},"vyrovnané","vynikající"]
[15,{"$f":"'SKUPINA 3'!C15","v":11},{"$f":"Jaro!BE18","v":0},{"$f":"Jaro!BF18","v":0},{"$f":"Jaro!BG18","v":0},{"$f":"Jaro!BH18","v":0},{"$f":"Jaro!BI18","v":0},":",{"$f":"Jaro!BK18","v":0},0,{"$f":"Jaro!BL18","v":0},"vyrovnané","vynikající"]
[16,{"$f":"'SKUPINA 3'!C16","v":12},{"$f":"Jaro!BE19","v":0},{"$f":"Jaro!BF19","v":0},{"$f":"Jaro!BG19","v":0},{"$f":"Jaro!BH19","v":0},{"$f":"Jaro!BI19","v":0},":",{"$f":"Jaro!BK19","v":0},0,{"$f":"Jaro!BL19","v":0},"vyrovnané","vynikající"]
[17,{"$f":"'SKUPINA 3'!C17","v":13},{"$f":"Jaro!BE20","v":0},{"$f":"Jaro!BF20","v":0},{"$f":"Jaro!BG20","v":0},{"$f":"Jaro!BH20","v":0},{"$f":"Jaro!BI20","v":0},":",{"$f":"Jaro!BK20","v":0},0,{"$f":"Jaro!BL20","v":0},{"$f":"IF(G19>I19,\"aktivní\",IF(G19=I19,\"vyrovnané\",\"pasivní\"))","v":"vyrovnané"},{"$f":"IF(K19>=80/100*C19*3,\"vynikající\",IF(K19<50/100*C19*3,\"neúspěšné\",\"dobré\"))","v":"vynikající"}]
[18,{"$f":"'SKUPINA 3'!C18","v":14},{"$f":"Jaro!BE21","v":0},{"$f":"Jaro!BF21","v":0},{"$f":"Jaro!BG21","v":0},{"$f":"Jaro!BH21","v":0},{"$f":"Jaro!BI21","v":0},":",{"$f":"Jaro!BK21","v":0},0,{"$f":"Jaro!BL21","v":0},{"$f":"IF(G20>I20,\"aktivní\",IF(G20=I20,\"vyrovnané\",\"pasivní\"))","v":"vyrovnané"},{"$f":"IF(K20>=80/100*C20*3,\"vynikající\",IF(K20<50/100*C20*3,\"neúspěšné\",\"dobré\"))","v":"vynikající"}]

{"sheet":"Pořadí 3","index":3,"n_rows":20,"n_cols":22,"rows_kept":20,"cut":false,"hidden":false,"merged":[[0,0,0,10],[1,6,1,8]]}
[{"$f":"'SKUPINA 3'!$A$1","v":"SKUPINA 3 hlavního turnaje v kategorii U9"}]
[null,null,"Utkání celkem","Vítězství","Remízy","Prohry","Skóre",null,null,"Rozdíl","Body","Hodnocení skóre","Hodnocení družstva"]
[9,{"$f":"'SKUPINA 3'!C6","v":"FK Meteor Praha"},{"$f":"SUM('SKUPINA 3'!AW6,Jaro!BE5)","v":3},{"$f":"SUM('SKUPINA 3'!AX6,Jaro!BF5)","v":3},{"$f":"SUM('SKUPINA 3'!AY6,Jaro!BG5)","v":0},{"$f":"SUM('SKUPINA 3'!AZ6,Jaro!BH5)","v":0},{"$f":"SUM('SKUPINA 3'!BA6,Jaro!BI5)","v":12},":",{"$f":"SUM('SKUPINA 3'!BC6,Jaro!BK5)","v":5},{"$f":"SUM(G3-I3)","v":7},{"$f":"SUM('SKUPINA 3'!BD6,Jaro!BL5)","v":9},{"$f":"IF(G2>I2,\"aktivní\",IF(G2=I2,\"vyrovnané\",\"pasivní\"))","v":"aktivní"},{"$f":"IF(K2>=80/100*C2*3,\"vynikající\",IF(K2<50/100*C2*3,\"neúspěšné\",\"dobré\"))","v":{"$error":"#VALUE!"}}]
[10,{"$f":"'SKUPINA 3'!C8","v":"FC Slovácko"},{"$f":"SUM('SKUPINA 3'!AW8,Jaro!BE7)","v":3},{"$f":"SUM('SKUPINA 3'!AX8,Jaro!BF7)","v":2},{"$f":"SUM('SKUPINA 3'!AY8,Jaro!BG7)","v":0},{"$f":"SUM('SKUPINA 3'!AZ8,Jaro!BH7)","v":1},{"$f":"SUM('SKUPINA 3'!BA8,Jaro!BI7)","v":20},":",{"$f":"SUM('SKUPINA 3'!BC8,Jaro!BK7)","v":7},{"$f":"SUM(G4-I4)","v":13},{"$f":"SUM('SKUPINA 3'!BD8,Jaro!BL7)","v":6},{"$f":"IF(G2>I2,\"aktivní\",IF(G2=I2,\"vyrovnané\",\"pasivní\"))","v":"aktivní"},{"$f":"IF(K2>=80/100*C2*3,\"vynikající\",IF(K2<50/100*C2*3,\"neúspěšné\",\"dobré\"))","v":{"$error":"#VALUE!"}}]
[11,{"$f":"'SKUPINA 3'!C7","v":"FC Velké Meziříčí"},{"$f":"SUM('SKUPINA 3'!AW7,Jaro!BE6)","v":3},{"$f":"SUM('SKUPINA 3'!AX7,Jaro!BF6)","v":1},{"$f":"SUM('SKUPINA 3'!AY7,Jaro!BG6)","v":0},{"$f":"SUM('SKUPINA 3'!AZ7,Jaro!BH6)","v":2},{"$f":"SUM('SKUPINA 3'!BA7,Jaro!BI6)","v":11},":",{"$f":"SUM('SKUPINA 3'!BC7,Jaro!BK6)","v":18},{"$f":"SUM(G5-I5)","v":-7},{"$f":"SUM('SKUPINA 3'!BD7,Jaro!BL6)","v":3},{"$f":"IF(G6>I6,\"aktivní\",IF(G6=I6,\"vyrovnané\",\"pasivní\"))","v":"pasivní"},{"$f":"IF(K6>=80/100*C6*3,\"vynikající\",IF(K6<50/100*C6*3,\"neúspěšné\",\"dobré\"))","v":"neúspěšné"}]
[12,{"$f":"'SKUPINA 3'!C5","v":"1.SK Prostějov"},{"$f":"SUM('SKUPINA 3'!AW5,Jaro!BE4)","v":3},{"$f":"SUM('SKUPINA 3'!AX5,Jaro!BF4)","v":0},{"$f":"SUM('SKUPINA 3'!AY5,Jaro!BG4)","v":0},{"$f":"SUM('SKUPINA 3'!AZ5,Jaro!BH4)","v":3},{"$f":"SUM('SKUPINA 3'!BA5,Jaro!BI4)","v":5},":",{"$f":"SUM('SKUPINA 3'!BC5,Jaro!BK4)","v":18},{"$f":"SUM(G6-I6)","v":-13},{"$f":"SUM('SKUPINA 3'!BD5,Jaro!BL4)","v":0},{"$f":"IF(G4>I4,\"aktivní\",IF(G4=I4,\"vyrovnané\",\"pasivní\"))","v":"aktivní"},{"$f":"IF(K4>=80/100*C4*3,\"vynikající\",IF(K4<50/100*C4*3,\"neúspěšné\",\"dobré\"))","v":"dobré"}]
[5,{"$f":"'SKUPINA 3'!C10","v":6},{"$f":"SUM('SKUPINA 3'!AW10,Jaro!BE9)","v":0},{"$f":"SUM('SKUPINA 3'!AX10,Jaro!BF9)","v":0},{"$f":"SUM('SKUPINA 3'!AY10,Jaro!BG9)","v":0},{"$f":"SUM('SKUPINA 3'!AZ10,Jaro!BH9)","v":0},{"$f":"SUM('SKUPINA 3'!BA10,Jaro!BI9)","v":0},":",{"$f":"SUM('SKUPINA 3'!BC10,Jaro!BK9)","v":0},{"$f":"SUM(G7-I7)","v":0},{"$f":"SUM('SKUPINA 3'!BD10,Jaro!BL9)","v":0},{"$f":"IF(G6>I6,\"aktivní\",IF(G6=I6,\"vyrovnané\",\"pasivní\"))","v":"pasivní"},{"$f":"IF(K6>=80/100*C6*3,\"vynikající\",IF(K6<50/100*C6*3,\"neúspěšné\",\"dobré\"))","v":"neúspěšné"}]
[6,{"$f":"'SKUPINA 3'!C11","v":7},{"$f":"SUM('SKUPINA 3'!AW11,Jaro!BE10)","v":0},{"$f":"SUM('SKUPINA 3'!AX11,Jaro!BF10)","v":0},{"$f":"SUM('SKUPINA 3'!AY11,Jaro!BG10)","v":0},{"$f":"SUM('SKUPINA 3'!AZ11,Jaro!BH10)","v":0},{"$f":"SUM('SKUPINA 3'!BA11,Jaro!BI10)","v":0},":",{"$f":"SUM('SKUPINA 3'!BC11,Jaro!BK10)","v":0},{"$f":"SUM(G8-I8)","v":0},{"$f":"SUM('SKUPINA 3'!BD11,Jaro!BL10)","v":0},{"$f":"IF(G7>I7,\"aktivní\",IF(G7=I7,\"vyrovnané\",\"pasivní\"))","v":"vyrovnané"},{"$f":"IF(K7>=80/100*C7*3,\"vynikající\",IF(K7<50/100*C7*3,\"neúspěšné\",\"dobré\"))","v":"vynikající"}]
[6,{"$f":"'SKUPINA 3'!C12","v":8},{"$f":"SUM('SKUPINA 3'!AW12,Jaro!BE11)","v":0},{"$f":"SUM('SKUPINA 3'!AX12,Jaro!BF11)","v":0},{"$f":"SUM('SKUPINA 3'!AY12,Jaro!BG11)","v":0},{"$f":"SUM('SKUPINA 3'!AZ12,Jaro!BH11)","v":0},{"$f":"SUM('SKUPINA 3'!BA12,Jaro!BI11)","v":0},":",{"$f":"SUM('SKUPINA 3'!BC12,Jaro!BK11)","v":0},{"$f":"SUM(G9-I9)","v":0},{"$f":"SUM('SKUPINA 3'!BD12,Jaro!BL11)","v":0},{"$f":"IF(G8>I8,\"aktivní\",IF(G8=I8,\"vyrovnané\",\"pasivní\"))","v":"vyrovnané"},{"$f":"IF(K8>=80/100*C8*3,\"vynikající\",IF(K8<50/100*C8*3,\"neúspěšné\",\"dobré\"))","v":"vynikající"}]
[7,{"$f":"'SKUPINA 3'!C13","v":9},{"$f":"SUM('SKUPINA 3'!AW13,Jaro!BE12)","v":0},{"$f":"SUM('SKUPINA 3'!AX13,Jaro!BF12)","v":0},{"$f":"SUM('SKUPINA 3'!AY13,Jaro!BG12)","v":0},{"$f":"SUM('SKUPINA 3'!AZ13,Jaro!BH12)","v":0},{"$f":"SUM('SKUPINA 3'!BA13,Jaro!BI12)","v":0},":",{"$f":"SUM('SKUPINA 3'!BC13,Jaro!BK12)","v":0},{"$f":"SUM(G10-I10)","v":0},{"$f":"SUM('SKUPINA 3'!BD13,Jaro!BL12)","v":0},{"$f":"IF(G9>I9,\"aktivní\",IF(G9=I9,\"vyrovnané\",\"pasivní\"))","v":"vyrovnané"},{"$f":"IF(K9>=80/100*C9*3,\"vynikající\",IF(K9<50/100*C9*3,\"neúspěšné\",\"dobré\"))","v":"vynikající"}]
[8,{"$f":"'SKUPINA 3'!C14","v":10},{"$f":"SUM('SKUPINA 3'!AW14,Jaro!BE13)","v":0},{"$f":"SUM('SKUPINA 3'!AX14,Jaro!BF13)","v":0},{"$f":"SUM('SKUPINA 3'!AY14,Jaro!BG13)","v":0},{"$f":"SUM('SKUPINA 3'!AZ14,Jaro!BH13)","v":0},{"$f":"SUM('SKUPINA 3'!BA14,Jaro!BI13)","v":0},":",{"$f":"SUM('SKUPINA 3'!BC14,Jaro!BK13)","v":0},{"$f":"SUM(G11-I11)","v":0},{"$f":"SUM('SKUPINA 3'!BD14,Jaro!BL13)","v":0},{"$f":"IF(G10>I10,\"aktivní\",IF(G10=I10,\"vyrovnané\",\"pasivní\"))","v":"vyrovnané"},{"$f":"IF(K10>=80/100*C10*3,\"vynikající\",IF(K10<50/100*C10*3,\"neúspěšné\",\"dobré\"))","v":"vynikající"}]
[9,{"$f":"'SKUPINA 3'!C15","v":11},{"$f":"SUM('SKUPINA 3'!AW15,Jaro!BE14)","v":0},{"$f":"SUM('SKUPINA 3'!AX15,Jaro!BF14)","v":0},{"$f":"SUM('SKUPINA 3'!AY15,Jaro!BG14)","v":0},{"$f":"SUM('SKUPINA 3'!AZ15,Jaro!BH14)","v":0},{"$f":"SUM('SKUPINA 3'!BA15,Jaro!BI14)","v":0},":",{"$f":"SUM('SKUPINA 3'!BC15,Jaro!BK14)","v":0},{"$f":"SUM(G12-I12)","v":0},{"$f":"SUM('SKUPINA 3'!BD15,Jaro!BL14)","v":0},{"$f":"IF(G11>I11,\"aktivní\",IF(G11=I11,\"vyrovnané\",\"pasivní\"))","v":"vyrovnané"},{"$f":"IF(K11>=80/100*C11*3,\"vynikající\",IF(K11<50/100*C11*3,\"neúspěšné\",\"dobré\"))","v":"vynikající"},null,null,null,null,null,null,null,null,"´´"]
[10,{"$f":"'SKUPINA 3'!C16","v":12},{"$f":"SUM('SKUPINA 3'!AW16,Jaro!BE15)","v":0},{"$f":"SUM('SKUPINA 3'!AX16,Jaro!BF15)","v":0},{"$f":"SUM('SKUPINA 3'!AY16,Jaro!BG15)","v":0},{"$f":"SUM('SKUPINA 3'!AZ16,Jaro!BH15)","v":0},{"$f":"SUM('SKUPINA 3'!BA16,Jaro!BI15)","v":0},":",{"$f":"SUM('SKUPINA 3'!BC16,Jaro!BK15)","v":0},{"$f":"SUM(G13-I13)","v":0},{"$f":"SUM('SKUPINA 3'!BD16,Jaro!BL15)","v":0},{"$f":"IF(G12>I12,\"aktivní\",IF(G12=I12,\"vyrovnané\",\"pasivní\"))","v":"vyrovnané"},{"$f":"IF(K12>=80/100*C12*3,\"vynikající\",IF(K12<50/100*C12*3,\"neúspěšné\",\"dobré\"))","v":"vynikající"}]
[11,{"$f":"'SKUPINA 3'!C17","v":13},{"$f":"SUM('SKUPINA 3'!AW17,Jaro!BE16)","v":0},{"$f":"SUM('SKUPINA 3'!AX17,Jaro!BF16)","v":0},{"$f":"SUM('SKUPINA 3'!AY17,Jaro!BG16)","v":0},{"$f":"SUM('SKUPINA 3'!AZ17,Jaro!BH16)","v":0},{"$f":"SUM('SKUPINA 3'!BA17,Jaro!BI16)","v":0},":",{"$f":"SUM('SKUPINA 3'!BC17,Jaro!BK16)","v":0},{"$f":"SUM(G14-I14)","v":0},{"$f":"SUM('SKUPINA 3'!BD17,Jaro!BL16)","v":0},{"$f":"IF(G13>I13,\"aktivní\",IF(G13=I13,\"vyrovnané\",\"pasivní\"))","v":"vyrovnané"},{"$f":"IF(K13>=80/100*C13*3,\"vynikající\",IF(K13<50/100*C13*3,\"neúspěšné\",\"dobré\"))","v":"vynikající"}]
[13,{"$f":"'SKUPINA 3'!C18","v":14},{"$f":"SUM('SKUPINA 3'!AW18,Jaro!BE17)","v":0},{"$f":"SUM('SKUPINA 3'!AX18,Jaro!BF17)","v":0},{"$f":"SUM('SKUPINA 3'!AY18,Jaro!BG17)","v":0},{"$f":"SUM('SKUPINA 3'!AZ18,Jaro!BH17)","v":0},{"$f":"SUM('SKUPINA 3'!BA18,Jaro!BI17)","v":0},":",{"$f":"SUM('SKUPINA 3'!BC18,Jaro!BK17)","v":0},{"$f":"SUM(G15-I15)","v":0},{"$f":"SUM('SKUPINA 3'!BD18,Jaro!BL17)","v":0},{"$f":"IF(G14>I14,\"aktivní\",IF(G14=I14,\"vyrovnané\",\"pasivní\"))","v":"vyrovnané"},{"$f":"IF(K14>=80/100*C14*3,\"vynikající\",IF(K14<50/100*C14*3,\"neúspěšné\",\"dobré\"))","v":"vynikající"}]
[14,{"$f":"'SKUPINA 3'!C6","v":"FK Meteor Praha"},{"$f":"SUM('SKUPINA 3'!AW6,Jaro!BE5)","v":3},{"$f":"SUM('SKUPINA 3'!AX6,Jaro!BF5)","v":3},{"$f":"SUM('SKUPINA 3'!AY6,Jaro!BG5)","v":0},{"$f":"SUM('SKUPINA 3'!AZ6,Jaro!BH5)","v":0},{"$f":"SUM('SKUPINA 3'!BA6,Jaro!BI5)","v":12},":",{"$f":"SUM('SKUPINA 3'!BC6,Jaro!BK5)","v":5},{"$f":"SUM(G16-I16)","v":7},{"$f":"SUM('SKUPINA 3'!BD6,Jaro!BL5)","v":9},{"$f":"IF(G15>I15,\"aktivní\",IF(G15=I15,\"vyrovnané\",\"pasivní\"))","v":"vyrovnané"},{"$f":"IF(K15>=80/100*C15*3,\"vynikající\",IF(K15<50/100*C15*3,\"neúspěšné\",\"dobré\"))","v":"vynikající"}]
[]
[]
[]
[null,"TOTO NENÍ DOTYKOVÁ OBRAZOVKA"]

{"sheet":"SKUPINA 3","index":4,"n_rows":23,"n_cols":76,"rows_kept":23,"cut":false,"hidden":false,"merged":[[18,45,18,47],[3,12,3,14],[3,18,3,20],[3,21,3,23],[3,24,3,26],[16,39,16,41],[3,30,3,32],[15,36,15,38],[3,45,3,47],[3,36,3,38],[3,27,3,29],[3,39,3,41],[3,42,3,44],[17,42,17,44],[6,9,6,11],[7,12,7,14],[3,15,3,17],[3,9,3,11],[14,33,14,35],[3,33,3,35],[0,0,0,55],[12,27,12,29],[13,30,13,32],[8,15,8,17],[9,18,9,20],[10,21,10,23],[11,24,11,26],[4,3,4,5],[5,6,5,8],[3,3,3,5],[3,6,3,8],[1,45,1,47],[1,18,1,20],[1,21,1,23],[1,39,1,41],[1,24,1,26],[1,71,3,71],[1,48,3,48],[1,49,3,49],[1,50,3,50],[1,51,3,51],[1,52,3,54],[1,55,3,55],[1,70,3,70],[1,3,1,5],[1,6,1,8],[1,9,1,11],[1,12,1,14],[1,15,1,17],[1,42,1,44],[1,27,1,29],[1,30,1,32],[1,33,1,35],[1,36,1,38]]}
["SKUPINA 3 hlavního turnaje v kategorii U9",null,null,null,null,null,null,null,null,null,null,null,null,null,null,null,null,null,null,null,null,null,null,null,null,null,null,null,null,null,null,null,null,null,null,null,null,null,null,null,null,null,null,null,null,null,null,null,null,null,null,null,null,null,null,null,null,null,null,null,null,null,null,null,null,null,null,null,null,null,null,null,"  "," "," ","  "]
[null,null,null,"A1",null,null,"A2",null,null,"A3",null,null,"A4",null,null,"A5",null,null,"A6",null,null,"A7",null,null,"A8",null,null,"A9",null,null,"A10",null,null,"A11",null,null,"A12",null,null,"A13",null,null,"A14",null,null,"A15",null,null,"Utkání celkem","Vítězství","Remízy","Prohry","Skóre",null,null,"Body",null,null,null,null,null,null,null,null,null,null,null,null,null,null,"Hodnocení skóre","Hodnocení družstva"]
[null,null,null,null,0,null,null,0,null,null,0,null,null,0,null,null,0,null,null,0,null,null,0,null,null,0,null,null,0,null,null,0,null,null,0,null,null,0,null,null,0,null,null,0,null,null,0]
[null,null,null,{"$f":"C5","v":"1.SK Prostějov"},null,null,{"$f":"C6","v":"FK Meteor Praha"},null,null,{"$f":"C7","v":"FC Velké Meziříčí"},null,null,{"$f":"C8","v":"FC Slovácko"},null,null,{"$f":"C9","v":5},null,null,{"$f":"C10","v":6},null,null,7,null,null,8,null,null,9,null,null,10,null,null,11,null,null,12,null,null,{"$f":"C17","v":13},null,null,{"$f":"C18","v":14},null,null,{"$f":"C19","v":15},null,null,null,null,null,null,null,null,null,null,2,3,4,5,6,7,8,9,10,11,12,13,14,15]
["A1",null,"1.SK Prostějov",null,null,null,2,":",3,3,":",6,0,":",9,null,":",null,null,":",null,null,":",null,null,":",null,null,":",null,null,":",null,null,":",null,null,":",null,null,":",null,null,":",null,null,":",null,{"$f":"COUNT(BE5:BR5)","v":3},{"$f":"COUNTIF(BE5:BR5,3)","v":0},{"$f":"COUNTIF(BE5:BR5,1)","v":0},{"$f":"COUNTIF(BE5:BR5,0)","v":3},{"$f":"SUM(D5,G5,J5,M5,P5,S5)","v":5},":",{"$f":"SUM(F5,I5,L5,O5,R5,U5)","v":18},{"$f":"SUM(BE5:BR5)","v":0},{"$f":"IF(G5=\"\",\"\",IF(G5>I5,3,IF(G5=I5,1,0)))","v":0},{"$f":"IF(J5=\"\",\"\",IF(J5>L5,3,IF(J5=L5,1,0)))","v":0},{"$f":"IF(M5=\"\",\"\",IF(M5>O5,3,IF(M5=O5,1,0)))","v":0},{"$f":"IF(P5=\"\",\"\",IF(P5>R5,3,IF(P5=R5,1,0)))","v":""},{"$f":"IF(S5=\"\",\"\",IF(S5>U5,3,IF(S5=U5,1,0)))","v":""},{"$f":"IF(V5=\"\",\"\",IF(V5>X5,3,IF(V5=X5,1,0)))","v":""},{"$f":"IF(Y5=\"\",\"\",IF(Y5>AA5,3,IF(Y5=AA5,1,0)))","v":""},{"$f":"IF(AB5=\"\",\"\",IF(AB5>AD5,3,IF(AB5=AD5,1,0)))","v":""},{"$f":"IF(AE5=\"\",\"\",IF(AE5>AG5,3,IF(AE5=AG5,1,0)))","v":""},{"$f":"IF(AH5=\"\",\"\",IF(AH5>AJ5,3,IF(AH5=AJ5,1,0)))","v":""},{"$f":"IF(AK5=\"\",\"\",IF(AK5>AM5,3,IF(AK5=AM5,1,0)))","v":""},{"$f":"IF(AN5=\"\",\"\",IF(AN5>AP5,3,IF(AN5=AP5,1,0)))","v":""},{"$f":"IF(AQ5=\"\",\"\",IF(AQ5>AS5,3,IF(AQ5=AS5,1,0)))","v":""},{"$f":"IF(AT5=\"\",\"\",IF(AT5>AV5,3,IF(AT5=AV5,1,0)))","v":""},{"$f":"IF(BA5>BC5,\"aktivní\",IF(BA5=BC5,\"vyrovnané\",\"pasivní\"))","v":"pasivní"},{"$f":"IF(BD5>=80/100*AW5*3,\"vynikající\",IF(BD5<50/100*AW5*3,\"neúspěšné\",\"dobré\"))","v":"neúspěšné"}]
["A2",null,"FK Meteor Praha",{"$f":"IF(I5=\"\",\"\",I5)","v":3},":",{"$f":"IF(G5=\"\",\"\",G5)","v":2},null,null,null,6,":",1,3,":",2,null,":",null,null,":",null,null,":",null,null,":",null,null,":",null,null,":",null,null,":",null,null,":",null,null,":",null,null,":",null,null,":",null,3,{"$f":"COUNTIF(BE6:BR6,3)","v":3},0,{"$f":"COUNTIF(BE6:BR6,0)","v":0},{"$f":"SUM(D6,G6,J6,M6,P6,S6)","v":12},":",{"$f":"SUM(F6,I6,L6,O6,R6,U6)","v":5},{"$f":"SUM(BE6:BR6)","v":9},{"$f":"IF(D6=\"\",\"\",IF(D6>F6,3,IF(D6=F6,1,0)))","v":3},{"$f":"IF(J6=\"\",\"\",IF(J6>L6,3,IF(J6=L6,1,0)))","v":3},{"$f":"IF(M6=\"\",\"\",IF(M6>O6,3,IF(M6=O6,1,0)))","v":3},{"$f":"IF(P6=\"\",\"\",IF(P6>R6,3,IF(P6=R6,1,0)))","v":""},{"$f":"IF(S6=\"\",\"\",IF(S6>U6,3,IF(S6=U6,1,0)))","v":""},"","","","","","",{"$f":"IF(AN6=\"\",\"\",IF(AN6>AP6,3,IF(AN6=AP6,1,0)))","v":""},{"$f":"IF(AQ6=\"\",\"\",IF(AQ6>AS6,3,IF(AQ6=AS6,1,0)))","v":""},{"$f":"IF(AT6=\"\",\"\",IF(AT6>AV6,3,IF(AT6=AV6,1,0)))","v":""},"aktivní","vynikající"]
["A3",null,"FC Velké Meziříčí",{"$f":"IF(L5=\"\",\"\",L5)","v":6},":",{"$f":"IF(J5=\"\",\"\",J5)","v":3},{"$f":"IF(L6=\"\",\"\",L6)","v":1},":",{"$f":"IF(J6=\"\",\"\",J6)","v":6},null,null,null,4,":",9,null,":",null,null,":",null,null,":",null,null,":",null,null,":",null,null,":",null,null,":",null,null,":",null,null,":",null,null,":",null,null,":",null,3,1,0,2,11,":",18,{"$f":"SUM(BE7:BR7)","v":3},{"$f":"IF(D7=\"\",\"\",IF(D7>F7,3,IF(D7=F7,1,0)))","v":3},{"$f":"IF(G7=\"\",\"\",IF(G7>I7,3,IF(G7=I7,1,0)))","v":0},{"$f":"IF(M7=\"\",\"\",IF(M7>O7,3,IF(M7=O7,1,0)))","v":0},{"$f":"IF(P7=\"\",\"\",IF(P7>R7,3,IF(P7=R7,1,0)))","v":""},{"$f":"IF(S7=\"\",\"\",IF(S7>U7,3,IF(S7=U7,1,0)))","v":""},"","","","","","","","","","pasivní","neúspěšné"]
["A4",null,"FC Slovácko",{"$f":"IF(O5=\"\",\"\",O5)","v":9},":",{"$f":"IF(M5=\"\",\"\",M5)","v":0},{"$f":"IF(O6=\"\",\"\",O6)","v":2},":",{"$f":"IF(M6=\"\",\"\",M6)","v":3},{"$f":"IF(O7=\"\",\"\",O7)","v":9},":",{"$f":"IF(M7=\"\",\"\",M7)","v":4},null,null,null,null,":",null,null,":",null,null,":",null,null,":",null,null,":",null,null,":",null,null,":",null,null,":",null,null,":",null,null,":",null,null,":",null,3,2,0,1,20,":",7,{"$f":"SUM(BE8:BR8)","v":6},3,0,{"$f":"IF(J8=\"\",\"\",IF(J8>L8,3,IF(J8=L8,1,0)))","v":3},{"$f":"IF(P8=\"\",\"\",IF(P8>R8,3,IF(P8=R8,1,0)))","v":""},{"$f":"IF(S8=\"\",\"\",IF(S8>U8,3,IF(S8=U8,1,0)))","v":""},"","","","","","","","","","aktivní","dobré"]
["A5",null,5,{"$f":"IF(R5=\"\",\"\",R5)","v":""},":",{"$f":"IF(P5=\"\",\"\",P5)","v":""},{"$f":"IF(R6=\"\",\"\",R6)","v":""},":",{"$f":"IF(P6=\"\",\"\",P6)","v":""},{"$f":"IF(R7=\"\",\"\",R7)","v":""},":",{"$f":"IF(P7=\"\",\"\",P7)","v":""},{"$f":"IF(R8=\"\",\"\",R8)","v":""},":",{"$f":"IF(P8=\"\",\"\",P8)","v":""},null,null,null,null,":",null,null,":",null,null,":",null,null,":",null,null,":",null,null,":",null,null,":",null,null,":",null,null,":",null,null,":",null,0,0,0,0,0,":",0,{"$f":"SUM(BE9:BR9)","v":0},"","",{"$f":"IF(J9=\"\",\"\",IF(J9>L9,3,IF(J9=L9,1,0)))","v":""},{"$f":"IF(M9=\"\",\"\",IF(M9>O9,3,IF(M9=O9,1,0)))","v":""},{"$f":"IF(S9=\"\",\"\",IF(S9>U9,3,IF(S9=U9,1,0)))","v":""},"","","","","","","","","","vyrovnané","vynikající"]
["A6",null,6,{"$f":"IF(U5=\"\",\"\",U5)","v":""},":",{"$f":"IF(S5=\"\",\"\",S5)","v":""},{"$f":"IF(U6=\"\",\"\",U6)","v":""},":",{"$f":"IF(S6=\"\",\"\",S6)","v":""},{"$f":"IF(U7=\"\",\"\",U7)","v":""},":",{"$f":"IF(S7=\"\",\"\",S7)","v":""},{"$f":"IF(U8=\"\",\"\",U8)","v":""},":",{"$f":"IF(S8=\"\",\"\",S8)","v":""},{"$f":"IF(U9=\"\",\"\",U9)","v":""},":",{"$f":"IF(S9=\"\",\"\",S9)","v":""},null,null,null,null,":",null,null,":",null,null,":",null,null,":",null,null,":",null,null,":",null,null,":",null,null,":",null,null,":",null,0,0,0,0,0,":",0,{"$f":"SUM(BE10:BR10)","v":0},"","","",{"$f":"IF(M10=\"\",\"\",IF(M10>O10,3,IF(M10=O10,1,0)))","v":""},{"$f":"IF(P10=\"\",\"\",IF(P10>R10,3,IF(P10=R10,1,0)))","v":""},"","","","","","","","","","vyrovnané","vynikající"]
["A7",null,7,{"$f":"IF(X5=\"\",\"\",X5)","v":""},":",{"$f":"IF(V5=\"\",\"\",V5)","v":""},{"$f":"IF(X6=\"\",\"\",X6)","v":""},":",{"$f":"IF(V6=\"\",\"\",V6)","v":""},{"$f":"IF(X7=\"\",\"\",X7)","v":""},":",{"$f":"IF(V7=\"\",\"\",V7)","v":""},{"$f":"IF(X8=\"\",\"\",X8)","v":""},":",{"$f":"IF(V8=\"\",\"\",V8)","v":""},{"$f":"IF(X9=\"\",\"\",X9)","v":""},":",{"$f":"IF(V9=\"\",\"\",V9)","v":""},{"$f":"IF(X10=\"\",\"\",X10)","v":""},":",{"$f":"IF(V10=\"\",\"\",V10)","v":""},null,null,null,null,":",null,null,":",null,null,":",null,null,":",null,null,":",null,null,":",null,null,":",null,null,":",null,0,0,0,0,{"$f":"SUM(D11,G11,J11,M11,P11,S11,V11,Y11,AB11,AE11,AH11,AK11,AN11,AQ11)","v":0},":",{"$f":"SUM(F11,I11,L11,O11,R11,U11,X11,AA11,AD11,AG11,AJ11,AM11,AP11,AS11)","v":0},0,"","","","","",{"$f":"IF(S11=\"\",\"\",IF(S11>U11,3,IF(S11=U11,1,0)))","v":""},"","","","","","","","","vyrovnané","vynikající"]
["A8",null,8,{"$f":"IF(AA5=\"\",\"\",AA5)","v":""},":",{"$f":"IF(Y5=\"\",\"\",Y5)","v":""},{"$f":"IF(AA6=\"\",\"\",AA6)","v":""},":",{"$f":"IF(Y6=\"\",\"\",Y6)","v":""},{"$f":"IF(AA7=\"\",\"\",AA7)","v":""},":",{"$f":"IF(Y7=\"\",\"\",Y7)","v":""},{"$f":"IF(AA8=\"\",\"\",AA8)","v":""},":",{"$f":"IF(Y8=\"\",\"\",Y8)","v":""},{"$f":"IF(AA9=\"\",\"\",AA9)","v":""},":",{"$f":"IF(Y9=\"\",\"\",Y9)","v":""},{"$f":"IF(AA10=\"\",\"\",AA10)","v":""},":",{"$f":"IF(Y10=\"\",\"\",Y10)","v":""},{"$f":"IF(AA11=\"\",\"\",AA11)","v":""},":",{"$f":"IF(Y11=\"\",\"\",Y11)","v":""},null,null,null,null,":",null,null,":",null,null,":",null,null,":",null,null,":",null,null,":",null,null,":",null,0,0,0,0,0,":",0,0,"","","","","","",{"$f":"IF(V12=\"\",\"\",IF(V12>X12,3,IF(V12=X12,1,0)))","v":""},{"$f":"IF(AB12=\"\",\"\",IF(AB12>AD12,3,IF(AB12=AD12,1,0)))","v":""},"","","","","","","vyrovnané","vynikající"]
["A9",null,9,{"$f":"IF(AD5=\"\",\"\",AD5)","v":""},":",{"$f":"IF(AB5=\"\",\"\",AB5)","v":""},{"$f":"IF(AD6=\"\",\"\",AD6)","v":""},":",{"$f":"IF(AB6=\"\",\"\",AB6)","v":""},{"$f":"IF(AD7=\"\",\"\",AD7)","v":""},":",{"$f":"IF(AB7=\"\",\"\",AB7)","v":""},{"$f":"IF(AD8=\"\",\"\",AD8)","v":""},":",{"$f":"IF(AB8=\"\",\"\",AB8)","v":""},{"$f":"IF(AD9=\"\",\"\",AD9)","v":""},":",{"$f":"IF(AB9=\"\",\"\",AB9)","v":""},{"$f":"IF(AD10=\"\",\"\",AD10)","v":""},":",{"$f":"IF(AB10=\"\",\"\",AB10)","v":""},{"$f":"IF(AD11=\"\",\"\",AD11)","v":""},":",{"$f":"IF(AB11=\"\",\"\",AB11)","v":""},{"$f":"IF(AD12=\"\",\"\",AD12)","v":""},":",{"$f":"IF(AB12=\"\",\"\",AB12)","v":""},null,null,null,null,":",null,null,":",null,null,":",null,null,":",null,null,":",null,null,":",null,0,0,0,0,0,":",0,0,"","","","","","","",{"$f":"IF(Y13=\"\",\"\",IF(Y13>AA13,3,IF(Y13=AA13,1,0)))","v":""},{"$f":"IF(AE13=\"\",\"\",IF(AE13>AG13,3,IF(AE13=AG13,1,0)))","v":""},"","","","","","vyrovnané","vynikající"]
["A10",null,10,{"$f":"IF(AG5=\"\",\"\",AG5)","v":""},":",{"$f":"IF(AE5=\"\",\"\",AE5)","v":""},{"$f":"IF(AG6=\"\",\"\",AG6)","v":""},":",{"$f":"IF(AE6=\"\",\"\",AE6)","v":""},{"$f":"IF(AG7=\"\",\"\",AG7)","v":""},":",{"$f":"IF(AE7=\"\",\"\",AE7)","v":""},{"$f":"IF(AG8=\"\",\"\",AG8)","v":""},":",{"$f":"IF(AE8=\"\",\"\",AE8)","v":""},{"$f":"IF(AG9=\"\",\"\",AG9)","v":""},":",{"$f":"IF(AE9=\"\",\"\",AE9)","v":""},{"$f":"IF(AG10=\"\",\"\",AG10)","v":""},":",{"$f":"IF(AE10=\"\",\"\",AE10)","v":""},{"$f":"IF(AG11=\"\",\"\",AG11)","v":""},":",{"$f":"IF(AE11=\"\",\"\",AE11)","v":""},{"$f":"IF(AG12=\"\",\"\",AG12)","v":""},":",{"$f":"IF(AE12=\"\",\"\",AE12)","v":""},{"$f":"IF(AG13=\"\",\"\",AG13)","v":""},":",{"$f":"IF(AE13=\"\",\"\",AE13)","v":""},null,null,null,null,":",null,null,":",null,null,":",null,null,":",null,null,":",null,0,0,0,0,0,":",0,0,"","","","","","","","",{"$f":"IF(AB14=\"\",\"\",IF(AB14>AD14,3,IF(AB14=AD14,1,0)))","v":""},{"$f":"IF(AH14=\"\",\"\",IF(AH14>AJ14,3,IF(AH14=AJ14,1,0)))","v":""},"","","","","vyrovnané","vynikající"]
["A11",null,11,{"$f":"IF(AJ5=\"\",\"\",AJ5)","v":""},":",{"$f":"IF(AH5=\"\",\"\",AH5)","v":""},{"$f":"IF(AJ6=\"\",\"\",AJ6)","v":""},":",{"$f":"IF(AH6=\"\",\"\",AH6)","v":""},{"$f":"IF(AJ7=\"\",\"\",AJ7)","v":""},":",{"$f":"IF(AH7=\"\",\"\",AH7)","v":""},{"$f":"IF(AJ8=\"\",\"\",AJ8)","v":""},":",{"$f":"IF(AH8=\"\",\"\",AH8)","v":""},{"$f":"IF(AJ9=\"\",\"\",AJ9)","v":""},":",{"$f":"IF(AH9=\"\",\"\",AH9)","v":""},{"$f":"IF(AJ10=\"\",\"\",AJ10)","v":""},":",{"$f":"IF(AH10=\"\",\"\",AH10)","v":""},{"$f":"IF(AJ11=\"\",\"\",AJ11)","v":""},":",{"$f":"IF(AH11=\"\",\"\",AH11)","v":""},{"$f":"IF(AJ12=\"\",\"\",AJ12)","v":""},":",{"$f":"IF(AH12=\"\",\"\",AH12)","v":""},{"$f":"IF(AJ13=\"\",\"\",AJ13)","v":""},":",{"$f":"IF(AH13=\"\",\"\",AH13)","v":""},{"$f":"IF(AJ14=\"\",\"\",AJ14)","v":""},":",{"$f":"IF(AH14=\"\",\"\",AH14)","v":""},null,null,null,null,":",null,null,":",null,null,":",null,null,":",null,0,0,0,0,0,":",0,0,"","","","","","","","","",{"$f":"IF(AE15=\"\",\"\",IF(AE15>AG15,3,IF(AE15=AG15,1,0)))","v":""},{"$f":"IF(AK15=\"\",\"\",IF(AK15>AM15,3,IF(AK15=AM15,1,0)))","v":""},"","","","vyrovnané","vynikající"]
["A12",null,12,{"$f":"IF(AM5=\"\",\"\",AM5)","v":""},":",{"$f":"IF(AK5=\"\",\"\",AK5)","v":""},{"$f":"IF(AM6=\"\",\"\",AM6)","v":""},":",{"$f":"IF(AK6=\"\",\"\",AK6)","v":""},{"$f":"IF(AM7=\"\",\"\",AM7)","v":""},":",{"$f":"IF(AK7=\"\",\"\",AK7)","v":""},{"$f":"IF(AM8=\"\",\"\",AM8)","v":""},":",{"$f":"IF(AK8=\"\",\"\",AK8)","v":""},{"$f":"IF(AM9=\"\",\"\",AM9)","v":""},":",{"$f":"IF(AK9=\"\",\"\",AK9)","v":""},{"$f":"IF(AM10=\"\",\"\",AM10)","v":""},":",{"$f":"IF(AK10=\"\",\"\",AK10)","v":""},{"$f":"IF(AM11=\"\",\"\",AM11)","v":""},":",{"$f":"IF(AK11=\"\",\"\",AK11)","v":""},{"$f":"IF(AM12=\"\",\"\",AM12)","v":""},":",{"$f":"IF(AK12=\"\",\"\",AK12)","v":""},{"$f":"IF(AM13=\"\",\"\",AM13)","v":""},":",{"$f":"IF(AK13=\"\",\"\",AK13)","v":""},{"$f":"IF(AM14=\"\",\"\",AM14)","v":""},":",{"$f":"IF(AK14=\"\",\"\",AK14)","v":""},{"$f":"IF(AM15=\"\",\"\",AM15)","v":""},":",{"$f":"IF(AK15=\"\",\"\",AK15)","v":""},null,null,null,null,":",null,null,":",null,null,":",null,0,0,0,0,0,":",0,0,"","","","","","","","","",{"$f":"IF(AE16=\"\",\"\",IF(AE16>AG16,3,IF(AE16=AG16,1,0)))","v":""},{"$f":"IF(AH16=\"\",\"\",IF(AH16>AJ16,3,IF(AH16=AJ16,1,0)))","v":""},{"$f":"IF(AN16=\"\",\"\",IF(AN16>AP16,3,IF(AN16=AP16,1,0)))","v":""},"","","vyrovnané","vynikající"]
["A13",null,13,{"$f":"IF(AP5=\"\",\"\",AP5)","v":""},":",{"$f":"IF(AN5=\"\",\"\",AN5)","v":""},{"$f":"IF(AP6=\"\",\"\",AP6)","v":""},":",{"$f":"IF(AN6=\"\",\"\",AN6)","v":""},{"$f":"IF(AP7=\"\",\"\",AP7)","v":""},":",{"$f":"IF(AN7=\"\",\"\",AN7)","v":""},{"$f":"IF(AP8=\"\",\"\",AP8)","v":""},":",{"$f":"IF(AN8=\"\",\"\",AN8)","v":""},{"$f":"IF(AP9=\"\",\"\",AP9)","v":""},":",{"$f":"IF(AN9=\"\",\"\",AN9)","v":""},{"$f":"IF(AP10=\"\",\"\",AP10)","v":""},":",{"$f":"IF(AN10=\"\",\"\",AN10)","v":""},{"$f":"IF(AP11=\"\",\"\",AP11)","v":""},":",{"$f":"IF(AN11=\"\",\"\",AN11)","v":""},{"$f":"IF(AP12=\"\",\"\",AP12)","v":""},":",{"$f":"IF(AN12=\"\",\"\",AN12)","v":""},{"$f":"IF(AP13=\"\",\"\",AP13)","v":""},":",{"$f":"IF(AN13=\"\",\"\",AN13)","v":""},{"$f":"IF(AP14=\"\",\"\",AP14)","v":""},":",{"$f":"IF(AN14=\"\",\"\",AN14)","v":""},{"$f":"IF(AP15=\"\",\"\",AP15)","v":""},":",{"$f":"IF(AN15=\"\",\"\",AN15)","v":""},{"$f":"IF(AP16=\"\",\"\",AP16)","v":""},":",{"$f":"IF(AN16=\"\",\"\",AN16)","v":""},null,null,null,null,":",null,null,":",null,0,0,0,0,0,":",0,0,"",{"$f":"IF(G17=\"\",\"\",IF(G17>I17,3,IF(G17=I17,1,0)))","v":""},{"$f":"IF(J17=\"\",\"\",IF(J17>L17,3,IF(J17=L17,1,0)))","v":""},{"$f":"IF(M17=\"\",\"\",IF(M17>O17,3,IF(M17=O17,1,0)))","v":""},{"$f":"IF(P17=\"\",\"\",IF(P17>R17,3,IF(P17=R17,1,0)))","v":""},"","","","",{"$f":"IF(AE17=\"\",\"\",IF(AE17>AG17,3,IF(AE17=AG17,1,0)))","v":""},{"$f":"IF(AH17=\"\",\"\",IF(AH17>AJ17,3,IF(AH17=AJ17,1,0)))","v":""},{"$f":"IF(AK17=\"\",\"\",IF(AK17>AM17,3,IF(AK17=AM17,1,0)))","v":""},"","","vyrovnané","vynikající"]
["A14",null,14,{"$f":"IF(AS5=\"\",\"\",AS5)","v":""},":",{"$f":"IF(AQ5=\"\",\"\",AQ5)","v":""},{"$f":"IF(AS6=\"\",\"\",AS6)","v":""},":",{"$f":"IF(AQ6=\"\",\"\",AQ6)","v":""},{"$f":"IF(AS7=\"\",\"\",AS7)","v":""},":",{"$f":"IF(AQ7=\"\",\"\",AQ7)","v":""},{"$f":"IF(AS8=\"\",\"\",AS8)","v":""},":",{"$f":"IF(AQ8=\"\",\"\",AQ8)","v":""},{"$f":"IF(AS9=\"\",\"\",AS9)","v":""},":",{"$f":"IF(AQ9=\"\",\"\",AQ9)","v":""},{"$f":"IF(AS10=\"\",\"\",AS10)","v":""},":",{"$f":"IF(AQ10=\"\",\"\",AQ10)","v":""},{"$f":"IF(AS11=\"\",\"\",AS11)","v":""},":",{"$f":"IF(AQ11=\"\",\"\",AQ11)","v":""},{"$f":"IF(AS12=\"\",\"\",AS12)","v":""},":",{"$f":"IF(AQ12=\"\",\"\",AQ12)","v":""},{"$f":"IF(AS13=\"\",\"\",AS13)","v":""},":",{"$f":"IF(AQ13=\"\",\"\",AQ13)","v":""},{"$f":"IF(AS14=\"\",\"\",AS14)","v":""},":",{"$f":"IF(AQ14=\"\",\"\",AQ14)","v":""},{"$f":"IF(AS15=\"\",\"\",AS15)","v":""},":",{"$f":"IF(AQ15=\"\",\"\",AQ15)","v":""},{"$f":"IF(AS16=\"\",\"\",AS16)","v":""},":",{"$f":"IF(AQ16=\"\",\"\",AQ16)","v":""},{"$f":"IF(AS17=\"\",\"\",AS17)","v":""},":",{"$f":"IF(AQ17=\"\",\"\",AQ17)","v":""},null,null,null,null,":",null,0,0,0,0,0,":",0,0,"",{"$f":"IF(G18=\"\",\"\",IF(G18>I18,3,IF(G18=I18,1,0)))","v":""},{"$f":"IF(J18=\"\",\"\",IF(J18>L18,3,IF(J18=L18,1,0)))","v":""},{"$f":"IF(M18=\"\",\"\",IF(M18>O18,3,IF(M18=O18,1,0)))","v":""},{"$f":"IF(P18=\"\",\"\",IF(P18>R18,3,IF(P18=R18,1,0)))","v":""},"","","","",{"$f":"IF(AE18=\"\",\"\",IF(AE18>AG18,3,IF(AE18=AG18,1,0)))","v":""},{"$f":"IF(AH18=\"\",\"\",IF(AH18>AJ18,3,IF(AH18=AJ18,1,0)))","v":""},{"$f":"IF(AK18=\"\",\"\",IF(AK18>AM18,3,IF(AK18=AM18,1,0)))","v":""},"","","vyrovnané","vynikající"]
["A15",null,15,{"$f":"IF(AV6=\"\",\"\",AV6)","v":""},":",{"$f":"IF(AT6=\"\",\"\",AT6)","v":""},{"$f":"IF(AV7=\"\",\"\",AV7)","v":""},":",{"$f":"IF(AT7=\"\",\"\",AT7)","v":""},{"$f":"IF(AV7=\"\",\"\",AV7)","v":""},":",{"$f":"IF(AT7=\"\",\"\",AT7)","v":""},{"$f":"IF(AV8=\"\",\"\",AV8)","v":""},":",{"$f":"IF(AT8=\"\",\"\",AT8)","v":""},{"$f":"IF(AV9=\"\",\"\",AV9)","v":""},":",{"$f":"IF(AT9=\"\",\"\",AT9)","v":""},{"$f":"IF(AV10=\"\",\"\",AV10)","v":""},":",{"$f":"IF(AT10=\"\",\"\",AT10)","v":""},{"$f":"IF(AV11=\"\",\"\",AV11)","v":""},":",{"$f":"IF(AT7=\"\",\"\",AT7)","v":""},{"$f":"IF(AV12=\"\",\"\",AV12)","v":""},":",{"$f":"IF(AT12=\"\",\"\",AT12)","v":""},{"$f":"IF(AV13=\"\",\"\",AV13)","v":""},":",{"$f":"IF(AT13=\"\",\"\",AT13)","v":""},{"$f":"IF(AV14=\"\",\"\",AV14)","v":""},":",{"$f":"IF(AT14=\"\",\"\",AT14)","v":""},{"$f":"IF(AV15=\"\",\"\",AV15)","v":""},":",{"$f":"IF(AT15=\"\",\"\",AT15)","v":""},{"$f":"IF(AV16=\"\",\"\",AV16)","v":""},":",{"$f":"IF(AT16=\"\",\"\",AT16)","v":""},{"$f":"IF(AV17=\"\",\"\",AV17)","v":""},":",{"$f":"IF(AT17=\"\",\"\",AT17)","v":""},{"$f":"IF(AV18=\"\",\"\",AV18)","v":""},":",{"$f":"IF(AT18=\"\",\"\",AT18)","v":""},null,null,null,0,0,0,0,0,":",0,0,{"$f":"IF(D19=\"\",\"\",IF(D19>F19,3,IF(D19=F19,1,0)))","v":""},{"$f":"IF(G19=\"\",\"\",IF(G19>I19,3,IF(G19=I19,1,0)))","v":""},{"$f":"IF(J19=\"\",\"\",IF(J19>L19,3,IF(J19=L19,1,0)))","v":""},{"$f":"IF(M19=\"\",\"\",IF(M19>O19,3,IF(M19=O19,1,0)))","v":""},{"$f":"IF(P19=\"\",\"\",IF(P19>R19,3,IF(P19=R19,1,0)))","v":""},"","","","",{"$f":"IF(AE19=\"\",\"\",IF(AE19>AG19,3,IF(AE19=AG19,1,0)))","v":""},{"$f":"IF(AH19=\"\",\"\",IF(AH19>AJ19,3,IF(AH19=AJ19,1,0)))","v":""},{"$f":"IF(AK19=\"\",\"\",IF(AK19>AM19,3,IF(AK19=AM19,1,0)))","v":""},"","","vyrovnané","vynikající"]
[]
[null,null,"   O PŘEPNUTÍ MEZI TABULKAMI SI ŘEKNĚTE U OBSLUHY PC         TOTO NENÍ DOTYKOVÁ OBRAZOVKA"]
[]
[null,null,null,null,"V tabulce musí být prázdný řádek a sloupec"]

{"sheet":"SKUPINA 4","index":5,"n_rows":23,"n_cols":76,"rows_kept":23,"cut":false,"hidden":false,"merged":[[1,45,1,47],[0,0,0,55],[1,3,1,5],[1,6,1,8],[1,9,1,11],[1,12,1,14],[1,15,1,17],[1,18,1,20],[1,21,1,23],[1,24,1,26],[1,27,1,29],[1,30,1,32],[1,33,1,35],[1,36,1,38],[1,39,1,41],[1,42,1,44],[1,70,3,70],[1,71,3,71],[3,3,3,5],[3,6,3,8],[3,9,3,11],[3,12,3,14],[3,15,3,17],[3,18,3,20],[3,21,3,23],[3,24,3,26],[1,48,3,48],[1,49,3,49],[1,50,3,50],[1,51,3,51],[1,52,3,54],[1,55,3,55],[8,15,8,17],[3,27,3,29],[3,30,3,32],[3,33,3,35],[3,36,3,38],[3,45,3,47],[4,3,4,5],[5,6,5,8],[6,9,6,11],[7,12,7,14],[3,39,3,41],[3,42,3,44],[15,36,15,38],[16,39,16,41],[17,42,17,44],[18,45,18,47],[9,18,9,20],[10,21,10,23],[11,24,11,26],[12,27,12,29],[13,30,13,32],[14,33,14,35]]}
["SKUPINA 4 hlavního turnaje v kategorii U9",null,null,null,null,null,null,null,null,null,null,null,null,null,null,null,null,null,null,null,null,null,null,null,null,null,null,null,null,null,null,null,null,null,null,null,null,null,null,null,null,null,null,null,null,null,null,null,null,null,null,null,null,null,null,null,null,null,null,null,null,null,null,null,null,null,null,null,null,null,null,null,"  "," "," ","  "]
[null,null,null,"A1",null,null,"A2",null,null,"A3",null,null,"A4",null,null,"A5",null,null,"A6",null,null,"A7",null,null,"A8",null,null,"A9",null,null,"A10",null,null,"A11",null,null,"A12",null,null,"A13",null,null,"A14",null,null,"A15",null,null,"Utkání celkem","Vítězství","Remízy","Prohry","Skóre",null,null,"Body",null,null,null,null,null,null,null,null,null,null,null,null,null,null,"Hodnocení skóre","Hodnocení družstva"]
[null,null,null,null,0,null,null,0,null,null,0,null,null,0,null,null,0,null,null,0,null,null,0,null,null,0,null,null,0,null,null,0,null,null,0,null,null,0,null,null,0,null,null,0,null,null,0]
[null,null,null,{"$f":"C5","v":"CU Bohemians Praha"},null,null,{"$f":"C6","v":"FKM Vysočina Jihlava"},null,null,{"$f":"C7","v":"RMSK \"Cidlina\" Nový Bydžov"},null,null,{"$f":"C8","v":"FK Pardubice"},null,null,{"$f":"C9","v":5},null,null,{"$f":"C10","v":6},null,null,7,null,null,8,null,null,9,null,null,10,null,null,11,null,null,12,null,null,{"$f":"C17","v":13},null,null,{"$f":"C18","v":14},null,null,{"$f":"C19","v":15},null,null,null,null,null,null,null,null,null,null,2,3,4,5,6,7,8,9,10,11,12,13,14,15]
["A1",null,"CU Bohemians Praha",null,null,null,3,":",3,3,":",3,2,":",1,null,":",null,null,":",null,null,":",null,null,":",null,null,":",null,null,":",null,null,":",null,null,":",null,null,":",null,null,":",null,null,":",null,{"$f":"COUNT(BE5:BR5)","v":3},{"$f":"COUNTIF(BE5:BR5,3)","v":1},{"$f":"COUNTIF(BE5:BR5,1)","v":2},{"$f":"COUNTIF(BE5:BR5,0)","v":0},{"$f":"SUM(D5,G5,J5,M5,P5,S5)","v":8},":",{"$f":"SUM(F5,I5,L5,O5,R5,U5)","v":7},{"$f":"SUM(BE5:BR5)","v":5},{"$f":"IF(G5=\"\",\"\",IF(G5>I5,3,IF(G5=I5,1,0)))","v":1},{"$f":"IF(J5=\"\",\"\",IF(J5>L5,3,IF(J5=L5,1,0)))","v":1},{"$f":"IF(M5=\"\",\"\",IF(M5>O5,3,IF(M5=O5,1,0)))","v":3},{"$f":"IF(P5=\"\",\"\",IF(P5>R5,3,IF(P5=R5,1,0)))","v":""},{"$f":"IF(S5=\"\",\"\",IF(S5>U5,3,IF(S5=U5,1,0)))","v":""},{"$f":"IF(V5=\"\",\"\",IF(V5>X5,3,IF(V5=X5,1,0)))","v":""},{"$f":"IF(Y5=\"\",\"\",IF(Y5>AA5,3,IF(Y5=AA5,1,0)))","v":""},{"$f":"IF(AB5=\"\",\"\",IF(AB5>AD5,3,IF(AB5=AD5,1,0)))","v":""},{"$f":"IF(AE5=\"\",\"\",IF(AE5>AG5,3,IF(AE5=AG5,1,0)))","v":""},{"$f":"IF(AH5=\"\",\"\",IF(AH5>AJ5,3,IF(AH5=AJ5,1,0)))","v":""},{"$f":"IF(AK5=\"\",\"\",IF(AK5>AM5,3,IF(AK5=AM5,1,0)))","v":""},{"$f":"IF(AN5=\"\",\"\",IF(AN5>AP5,3,IF(AN5=AP5,1,0)))","v":""},{"$f":"IF(AQ5=\"\",\"\",IF(AQ5>AS5,3,IF(AQ5=AS5,1,0)))","v":""},{"$f":"IF(AT5=\"\",\"\",IF(AT5>AV5,3,IF(AT5=AV5,1,0)))","v":""},{"$f":"IF(BA5>BC5,\"aktivní\",IF(BA5=BC5,\"vyrovnané\",\"pasivní\"))","v":"aktivní"},{"$f":"IF(BD5>=80/100*AW5*3,\"vynikající\",IF(BD5<50/100*AW5*3,\"neúspěšné\",\"dobré\"))","v":"dobré"}]
["A2",null,"FKM Vysočina Jihlava",{"$f":"IF(I5=\"\",\"\",I5)","v":3},":",{"$f":"IF(G5=\"\",\"\",G5)","v":3},null,null,null,11,":",4,6,":",3,null,":",null,null,":",null,null,":",null,null,":",null,null,":",null,null,":",null,null,":",null,null,":",null,null,":",null,null,":",null,null,":",null,3,{"$f":"COUNTIF(BE6:BR6,3)","v":2},1,{"$f":"COUNTIF(BE6:BR6,0)","v":0},{"$f":"SUM(D6,G6,J6,M6,P6,S6)","v":20},":",{"$f":"SUM(F6,I6,L6,O6,R6,U6)","v":10},{"$f":"SUM(BE6:BR6)","v":7},{"$f":"IF(D6=\"\",\"\",IF(D6>F6,3,IF(D6=F6,1,0)))","v":1},{"$f":"IF(J6=\"\",\"\",IF(J6>L6,3,IF(J6=L6,1,0)))","v":3},{"$f":"IF(M6=\"\",\"\",IF(M6>O6,3,IF(M6=O6,1,0)))","v":3},{"$f":"IF(P6=\"\",\"\",IF(P6>R6,3,IF(P6=R6,1,0)))","v":""},{"$f":"IF(S6=\"\",\"\",IF(S6>U6,3,IF(S6=U6,1,0)))","v":""},"","","","","","",{"$f":"IF(AN6=\"\",\"\",IF(AN6>AP6,3,IF(AN6=AP6,1,0)))","v":""},{"$f":"IF(AQ6=\"\",\"\",IF(AQ6>AS6,3,IF(AQ6=AS6,1,0)))","v":""},{"$f":"IF(AT6=\"\",\"\",IF(AT6>AV6,3,IF(AT6=AV6,1,0)))","v":""},"aktivní","dobré"]
["A3",null,"RMSK \"Cidlina\" Nový Bydžov",{"$f":"IF(L5=\"\",\"\",L5)","v":3},":",{"$f":"IF(J5=\"\",\"\",J5)","v":3},{"$f":"IF(L6=\"\",\"\",L6)","v":4},":",{"$f":"IF(J6=\"\",\"\",J6)","v":11},null,null,null,6,":",3,null,":",null,null,":",null,null,":",null,null,":",null,null,":",null,null,":",null,null,":",null,null,":",null,null,":",null,null,":",null,null,":",null,3,1,1,1,13,":",17,{"$f":"SUM(BE7:BR7)","v":4},{"$f":"IF(D7=\"\",\"\",IF(D7>F7,3,IF(D7=F7,1,0)))","v":1},{"$f":"IF(G7=\"\",\"\",IF(G7>I7,3,IF(G7=I7,1,0)))","v":0},{"$f":"IF(M7=\"\",\"\",IF(M7>O7,3,IF(M7=O7,1,0)))","v":3},{"$f":"IF(P7=\"\",\"\",IF(P7>R7,3,IF(P7=R7,1,0)))","v":""},{"$f":"IF(S7=\"\",\"\",IF(S7>U7,3,IF(S7=U7,1,0)))","v":""},"","","","","","","","","","pasivní","neúspěšné"]
["A4",null,"FK Pardubice",{"$f":"IF(O5=\"\",\"\",O5)","v":1},":",{"$f":"IF(M5=\"\",\"\",M5)","v":2},{"$f":"IF(O6=\"\",\"\",O6)","v":3},":",{"$f":"IF(M6=\"\",\"\",M6)","v":6},{"$f":"IF(O7=\"\",\"\",O7)","v":3},":",{"$f":"IF(M7=\"\",\"\",M7)","v":6},null,null,null,null,":",null,null,":",null,null,":",null,null,":",null,null,":",null,null,":",null,null,":",null,null,":",null,null,":",null,null,":",null,null,":",null,3,0,0,3,7,":",14,{"$f":"SUM(BE8:BR8)","v":0},0,0,{"$f":"IF(J8=\"\",\"\",IF(J8>L8,3,IF(J8=L8,1,0)))","v":0},{"$f":"IF(P8=\"\",\"\",IF(P8>R8,3,IF(P8=R8,1,0)))","v":""},{"$f":"IF(S8=\"\",\"\",IF(S8>U8,3,IF(S8=U8,1,0)))","v":""},"","","","","","","","","","pasivní","neúspěšné"]
["A5",null,5,{"$f":"IF(R5=\"\",\"\",R5)","v":""},":",{"$f":"IF(P5=\"\",\"\",P5)","v":""},{"$f":"IF(R6=\"\",\"\",R6)","v":""},":",{"$f":"IF(P6=\"\",\"\",P6)","v":""},{"$f":"IF(R7=\"\",\"\",R7)","v":""},":",{"$f":"IF(P7=\"\",\"\",P7)","v":""},{"$f":"IF(R8=\"\",\"\",R8)","v":""},":",{"$f":"IF(P8=\"\",\"\",P8)","v":""},null,null,null,null,":",null,null,":",null,null,":",null,null,":",null,null,":",null,null,":",null,null,":",null,null,":",null,null,":",null,null,":",null,0,0,0,0,0,":",0,{"$f":"SUM(BE9:BR9)","v":0},"","",{"$f":"IF(J9=\"\",\"\",IF(J9>L9,3,IF(J9=L9,1,0)))","v":""},{"$f":"IF(M9=\"\",\"\",IF(M9>O9,3,IF(M9=O9,1,0)))","v":""},{"$f":"IF(S9=\"\",\"\",IF(S9>U9,3,IF(S9=U9,1,0)))","v":""},"","","","","","","","","","vyrovnané","vynikající"]
["A6",null,6,{"$f":"IF(U5=\"\",\"\",U5)","v":""},":",{"$f":"IF(S5=\"\",\"\",S5)","v":""},{"$f":"IF(U6=\"\",\"\",U6)","v":""},":",{"$f":"IF(S6=\"\",\"\",S6)","v":""},{"$f":"IF(U7=\"\",\"\",U7)","v":""},":",{"$f":"IF(S7=\"\",\"\",S7)","v":""},{"$f":"IF(U8=\"\",\"\",U8)","v":""},":",{"$f":"IF(S8=\"\",\"\",S8)","v":""},{"$f":"IF(U9=\"\",\"\",U9)","v":""},":",{"$f":"IF(S9=\"\",\"\",S9)","v":""},null,null,null,null,":",null,null,":",null,null,":",null,null,":",null,null,":",null,null,":",null,null,":",null,null,":",null,null,":",null,0,0,0,0,0,":",0,{"$f":"SUM(BE10:BR10)","v":0},"","","",{"$f":"IF(M10=\"\",\"\",IF(M10>O10,3,IF(M10=O10,1,0)))","v":""},{"$f":"IF(P10=\"\",\"\",IF(P10>R10,3,IF(P10=R10,1,0)))","v":""},"","","","","","","","","","vyrovnané","vynikající"]
["A7",null,7,{"$f":"IF(X5=\"\",\"\",X5)","v":""},":",{"$f":"IF(V5=\"\",\"\",V5)","v":""},{"$f":"IF(X6=\"\",\"\",X6)","v":""},":",{"$f":"IF(V6=\"\",\"\",V6)","v":""},{"$f":"IF(X7=\"\",\"\",X7)","v":""},":",{"$f":"IF(V7=\"\",\"\",V7)","v":""},{"$f":"IF(X8=\"\",\"\",X8)","v":""},":",{"$f":"IF(V8=\"\",\"\",V8)","v":""},{"$f":"IF(X9=\"\",\"\",X9)","v":""},":",{"$f":"IF(V9=\"\",\"\",V9)","v":""},{"$f":"IF(X10=\"\",\"\",X10)","v":""},":",{"$f":"IF(V10=\"\",\"\",V10)","v":""},null,null,null,null,":",null,null,":",null,null,":",null,null,":",null,null,":",null,null,":",null,null,":",null,null,":",null,0,0,0,0,{"$f":"SUM(D11,G11,J11,M11,P11,S11,V11,Y11,AB11,AE11,AH11,AK11,AN11,AQ11)","v":0},":",{"$f":"SUM(F11,I11,L11,O11,R11,U11,X11,AA11,AD11,AG11,AJ11,AM11,AP11,AS11)","v":0},0,"","","","","",{"$f":"IF(S11=\"\",\"\",IF(S11>U11,3,IF(S11=U11,1,0)))","v":""},"","","","","","","","","vyrovnané","vynikající"]
["A8",null,8,{"$f":"IF(AA5=\"\",\"\",AA5)","v":""},":",{"$f":"IF(Y5=\"\",\"\",Y5)","v":""},{"$f":"IF(AA6=\"\",\"\",AA6)","v":""},":",{"$f":"IF(Y6=\"\",\"\",Y6)","v":""},{"$f":"IF(AA7=\"\",\"\",AA7)","v":""},":",{"$f":"IF(Y7=\"\",\"\",Y7)","v":""},{"$f":"IF(AA8=\"\",\"\",AA8)","v":""},":",{"$f":"IF(Y8=\"\",\"\",Y8)","v":""},{"$f":"IF(AA9=\"\",\"\",AA9)","v":""},":",{"$f":"IF(Y9=\"\",\"\",Y9)","v":""},{"$f":"IF(AA10=\"\",\"\",AA10)","v":""},":",{"$f":"IF(Y10=\"\",\"\",Y10)","v":""},{"$f":"IF(AA11=\"\",\"\",AA11)","v":""},":",{"$f":"IF(Y11=\"\",\"\",Y11)","v":""},null,null,null,null,":",null,null,":",null,null,":",null,null,":",null,null,":",null,null,":",null,null,":",null,0,0,0,0,0,":",0,0,"","","","","","",{"$f":"IF(V12=\"\",\"\",IF(V12>X12,3,IF(V12=X12,1,0)))","v":""},{"$f":"IF(AB12=\"\",\"\",IF(AB12>AD12,3,IF(AB12=AD12,1,0)))","v":""},"","","","","","","vyrovnané","vynikající"]
["A9",null,9,{"$f":"IF(AD5=\"\",\"\",AD5)","v":""},":",{"$f":"IF(AB5=\"\",\"\",AB5)","v":""},{"$f":"IF(AD6=\"\",\"\",AD6)","v":""},":",{"$f":"IF(AB6=\"\",\"\",AB6)","v":""},{"$f":"IF(AD7=\"\",\"\",AD7)","v":""},":",{"$f":"IF(AB7=\"\",\"\",AB7)","v":""},{"$f":"IF(AD8=\"\",\"\",AD8)","v":""},":",{"$f":"IF(AB8=\"\",\"\",AB8)","v":""},{"$f":"IF(AD9=\"\",\"\",AD9)","v":""},":",{"$f":"IF(AB9=\"\",\"\",AB9)","v":""},{"$f":"IF(AD10=\"\",\"\",AD10)","v":""},":",{"$f":"IF(AB10=\"\",\"\",AB10)","v":""},{"$f":"IF(AD11=\"\",\"\",AD11)","v":""},":",{"$f":"IF(AB11=\"\",\"\",AB11)","v":""},{"$f":"IF(AD12=\"\",\"\",AD12)","v":""},":",{"$f":"IF(AB12=\"\",\"\",AB12)","v":""},null,null,null,null,":",null,null,":",null,null,":",null,null,":",null,null,":",null,null,":",null,0,0,0,0,0,":",0,0,"","","","","","","",{"$f":"IF(Y13=\"\",\"\",IF(Y13>AA13,3,IF(Y13=AA13,1,0)))","v":""},{"$f":"IF(AE13=\"\",\"\",IF(AE13>AG13,3,IF(AE13=AG13,1,0)))","v":""},"","","","","","vyrovnané","vynikající"]
["A10",null,10,{"$f":"IF(AG5=\"\",\"\",AG5)","v":""},":",{"$f":"IF(AE5=\"\",\"\",AE5)","v":""},{"$f":"IF(AG6=\"\",\"\",AG6)","v":""},":",{"$f":"IF(AE6=\"\",\"\",AE6)","v":""},{"$f":"IF(AG7=\"\",\"\",AG7)","v":""},":",{"$f":"IF(AE7=\"\",\"\",AE7)","v":""},{"$f":"IF(AG8=\"\",\"\",AG8)","v":""},":",{"$f":"IF(AE8=\"\",\"\",AE8)","v":""},{"$f":"IF(AG9=\"\",\"\",AG9)","v":""},":",{"$f":"IF(AE9=\"\",\"\",AE9)","v":""},{"$f":"IF(AG10=\"\",\"\",AG10)","v":""},":",{"$f":"IF(AE10=\"\",\"\",AE10)","v":""},{"$f":"IF(AG11=\"\",\"\",AG11)","v":""},":",{"$f":"IF(AE11=\"\",\"\",AE11)","v":""},{"$f":"IF(AG12=\"\",\"\",AG12)","v":""},":",{"$f":"IF(AE12=\"\",\"\",AE12)","v":""},{"$f":"IF(AG13=\"\",\"\",AG13)","v":""},":",{"$f":"IF(AE13=\"\",\"\",AE13)","v":""},null,null,null,null,":",null,null,":",null,null,":",null,null,":",null,null,":",null,0,0,0,0,0,":",0,0,"","","","","","","","",{"$f":"IF(AB14=\"\",\"\",IF(AB14>AD14,3,IF(AB14=AD14,1,0)))","v":""},{"$f":"IF(AH14=\"\",\"\",IF(AH14>AJ14,3,IF(AH14=AJ14,1,0)))","v":""},"","","","","vyrovnané","vynikající"]
["A11",null,11,{"$f":"IF(AJ5=\"\",\"\",AJ5)","v":""},":",{"$f":"IF(AH5=\"\",\"\",AH5)","v":""},{"$f":"IF(AJ6=\"\",\"\",AJ6)","v":""},":",{"$f":"IF(AH6=\"\",\"\",AH6)","v":""},{"$f":"IF(AJ7=\"\",\"\",AJ7)","v":""},":",{"$f":"IF(AH7=\"\",\"\",AH7)","v":""},{"$f":"IF(AJ8=\"\",\"\",AJ8)","v":""},":",{"$f":"IF(AH8=\"\",\"\",AH8)","v":""},{"$f":"IF(AJ9=\"\",\"\",AJ9)","v":""},":",{"$f":"IF(AH9=\"\",\"\",AH9)","v":""},{"$f":"IF(AJ10=\"\",\"\",AJ10)","v":""},":",{"$f":"IF(AH10=\"\",\"\",AH10)","v":""},{"$f":"IF(AJ11=\"\",\"\",AJ11)","v":""},":",{"$f":"IF(AH11=\"\",\"\",AH11)","v":""},{"$f":"IF(AJ12=\"\",\"\",AJ12)","v":""},":",{"$f":"IF(AH12=\"\",\"\",AH12)","v":""},{"$f":"IF(AJ13=\"\",\"\",AJ13)","v":""},":",{"$f":"IF(AH13=\"\",\"\",AH13)","v":""},{"$f":"IF(AJ14=\"\",\"\",AJ14)","v":""},":",{"$f":"IF(AH14=\"\",\"\",AH14)","v":""},null,null,null,null,":",null,null,":",null,null,":",null,null,":",null,0,0,0,0,0,":",0,0,"","","","","","","","","",{"$f":"IF(AE15=\"\",\"\",IF(AE15>AG15,3,IF(AE15=AG15,1,0)))","v":""},{"$f":"IF(AK15=\"\",\"\",IF(AK15>AM15,3,IF(AK15=AM15,1,0)))","v":""},"","","","vyrovnané","vynikající"]
["A12",null,12,{"$f":"IF(AM5=\"\",\"\",AM5)","v":""},":",{"$f":"IF(AK5=\"\",\"\",AK5)","v":""},{"$f":"IF(AM6=\"\",\"\",AM6)","v":""},":",{"$f":"IF(AK6=\"\",\"\",AK6)","v":""},{"$f":"IF(AM7=\"\",\"\",AM7)","v":""},":",{"$f":"IF(AK7=\"\",\"\",AK7)","v":""},{"$f":"IF(AM8=\"\",\"\",AM8)","v":""},":",{"$f":"IF(AK8=\"\",\"\",AK8)","v":""},{"$f":"IF(AM9=\"\",\"\",AM9)","v":""},":",{"$f":"IF(AK9=\"\",\"\",AK9)","v":""},{"$f":"IF(AM10=\"\",\"\",AM10)","v":""},":",{"$f":"IF(AK10=\"\",\"\",AK10)","v":""},{"$f":"IF(AM11=\"\",\"\",AM11)","v":""},":",{"$f":"IF(AK11=\"\",\"\",AK11)","v":""},{"$f":"IF(AM12=\"\",\"\",AM12)","v":""},":",{"$f":"IF(AK12=\"\",\"\",AK12)","v":""},{"$f":"IF(AM13=\"\",\"\",AM13)","v":""},":",{"$f":"IF(AK13=\"\",\"\",AK13)","v":""},{"$f":"IF(AM14=\"\",\"\",AM14)","v":""},":",{"$f":"IF(AK14=\"\",\"\",AK14)","v":""},{"$f":"IF(AM15=\"\",\"\",AM15)","v":""},":",{"$f":"IF(AK15=\"\",\"\",AK15)","v":""},null,null,null,null,":",null,null,":",null,null,":",null,0,0,0,0,0,":",0,0,"","","","","","","","","",{"$f":"IF(AE16=\"\",\"\",IF(AE16>AG16,3,IF(AE16=AG16,1,0)))","v":""},{"$f":"IF(AH16=\"\",\"\",IF(AH16>AJ16,3,IF(AH16=AJ16,1,0)))","v":""},{"$f":"IF(AN16=\"\",\"\",IF(AN16>AP16,3,IF(AN16=AP16,1,0)))","v":""},"","","vyrovnané","vynikající"]
["A13",null,13,{"$f":"IF(AP5=\"\",\"\",AP5)","v":""},":",{"$f":"IF(AN5=\"\",\"\",AN5)","v":""},{"$f":"IF(AP6=\"\",\"\",AP6)","v":""},":",{"$f":"IF(AN6=\"\",\"\",AN6)","v":""},{"$f":"IF(AP7=\"\",\"\",AP7)","v":""},":",{"$f":"IF(AN7=\"\",\"\",AN7)","v":""},{"$f":"IF(AP8=\"\",\"\",AP8)","v":""},":",{"$f":"IF(AN8=\"\",\"\",AN8)","v":""},{"$f":"IF(AP9=\"\",\"\",AP9)","v":""},":",{"$f":"IF(AN9=\"\",\"\",AN9)","v":""},{"$f":"IF(AP10=\"\",\"\",AP10)","v":""},":",{"$f":"IF(AN10=\"\",\"\",AN10)","v":""},{"$f":"IF(AP11=\"\",\"\",AP11)","v":""},":",{"$f":"IF(AN11=\"\",\"\",AN11)","v":""},{"$f":"IF(AP12=\"\",\"\",AP12)","v":""},":",{"$f":"IF(AN12=\"\",\"\",AN12)","v":""},{"$f":"IF(AP13=\"\",\"\",AP13)","v":""},":",{"$f":"IF(AN13=\"\",\"\",AN13)","v":""},{"$f":"IF(AP14=\"\",\"\",AP14)","v":""},":",{"$f":"IF(AN14=\"\",\"\",AN14)","v":""},{"$f":"IF(AP15=\"\",\"\",AP15)","v":""},":",{"$f":"IF(AN15=\"\",\"\",AN15)","v":""},{"$f":"IF(AP16=\"\",\"\",AP16)","v":""},":",{"$f":"IF(AN16=\"\",\"\",AN16)","v":""},null,null,null,null,":",null,null,":",null,0,0,0,0,0,":",0,0,"",{"$f":"IF(G17=\"\",\"\",IF(G17>I17,3,IF(G17=I17,1,0)))","v":""},{"$f":"IF(J17=\"\",\"\",IF(J17>L17,3,IF(J17=L17,1,0)))","v":""},{"$f":"IF(M17=\"\",\"\",IF(M17>O17,3,IF(M17=O17,1,0)))","v":""},{"$f":"IF(P17=\"\",\"\",IF(P17>R17,3,IF(P17=R17,1,0)))","v":""},"","","","",{"$f":"IF(AE17=\"\",\"\",IF(AE17>AG17,3,IF(AE17=AG17,1,0)))","v":""},{"$f":"IF(AH17=\"\",\"\",IF(AH17>AJ17,3,IF(AH17=AJ17,1,0)))","v":""},{"$f":"IF(AK17=\"\",\"\",IF(AK17>AM17,3,IF(AK17=AM17,1,0)))","v":""},"","","vyrovnané","vynikající"]
["A14",null,14,{"$f":"IF(AS5=\"\",\"\",AS5)","v":""},":",{"$f":"IF(AQ5=\"\",\"\",AQ5)","v":""},{"$f":"IF(AS6=\"\",\"\",AS6)","v":""},":",{"$f":"IF(AQ6=\"\",\"\",AQ6)","v":""},{"$f":"IF(AS7=\"\",\"\",AS7)","v":""},":",{"$f":"IF(AQ7=\"\",\"\",AQ7)","v":""},{"$f":"IF(AS8=\"\",\"\",AS8)","v":""},":",{"$f":"IF(AQ8=\"\",\"\",AQ8)","v":""},{"$f":"IF(AS9=\"\",\"\",AS9)","v":""},":",{"$f":"IF(AQ9=\"\",\"\",AQ9)","v":""},{"$f":"IF(AS10=\"\",\"\",AS10)","v":""},":",{"$f":"IF(AQ10=\"\",\"\",AQ10)","v":""},{"$f":"IF(AS11=\"\",\"\",AS11)","v":""},":",{"$f":"IF(AQ11=\"\",\"\",AQ11)","v":""},{"$f":"IF(AS12=\"\",\"\",AS12)","v":""},":",{"$f":"IF(AQ12=\"\",\"\",AQ12)","v":""},{"$f":"IF(AS13=\"\",\"\",AS13)","v":""},":",{"$f":"IF(AQ13=\"\",\"\",AQ13)","v":""},{"$f":"IF(AS14=\"\",\"\",AS14)","v":""},":",{"$f":"IF(AQ14=\"\",\"\",AQ14)","v":""},{"$f":"IF(AS15=\"\",\"\",AS15)","v":""},":",{"$f":"IF(AQ15=\"\",\"\",AQ15)","v":""},{"$f":"IF(AS16=\"\",\"\",AS16)","v":""},":",{"$f":"IF(AQ16=\"\",\"\",AQ16)","v":""},{"$f":"IF(AS17=\"\",\"\",AS17)","v":""},":",{"$f":"IF(AQ17=\"\",\"\",AQ17)","v":""},null,null,null,null,":",null,0,0,0,0,0,":",0,0,"",{"$f":"IF(G18=\"\",\"\",IF(G18>I18,3,IF(G18=I18,1,0)))","v":""},{"$f":"IF(J18=\"\",\"\",IF(J18>L18,3,IF(J18=L18,1,0)))","v":""},{"$f":"IF(M18=\"\",\"\",IF(M18>O18,3,IF(M18=O18,1,0)))","v":""},{"$f":"IF(P18=\"\",\"\",IF(P18>R18,3,IF(P18=R18,1,0)))","v":""},"","","","",{"$f":"IF(AE18=\"\",\"\",IF(AE18>AG18,3,IF(AE18=AG18,1,0)))","v":""},{"$f":"IF(AH18=\"\",\"\",IF(AH18>AJ18,3,IF(AH18=AJ18,1,0)))","v":""},{"$f":"IF(AK18=\"\",\"\",IF(AK18>AM18,3,IF(AK18=AM18,1,0)))","v":""},"","","vyrovnané","vynikající"]
["A15",null,15,{"$f":"IF(AV6=\"\",\"\",AV6)","v":""},":",{"$f":"IF(AT6=\"\",\"\",AT6)","v":""},{"$f":"IF(AV7=\"\",\"\",AV7)","v":""},":",{"$f":"IF(AT7=\"\",\"\",AT7)","v":""},{"$f":"IF(AV7=\"\",\"\",AV7)","v":""},":",{"$f":"IF(AT7=\"\",\"\",AT7)","v":""},{"$f":"IF(AV8=\"\",\"\",AV8)","v":""},":",{"$f":"IF(AT8=\"\",\"\",AT8)","v":""},{"$f":"IF(AV9=\"\",\"\",AV9)","v":""},":",{"$f":"IF(AT9=\"\",\"\",AT9)","v":""},{"$f":"IF(AV10=\"\",\"\",AV10)","v":""},":",{"$f":"IF(AT10=\"\",\"\",AT10)","v":""},{"$f":"IF(AV11=\"\",\"\",AV11)","v":""},":",{"$f":"IF(AT7=\"\",\"\",AT7)","v":""},{"$f":"IF(AV12=\"\",\"\",AV12)","v":""},":",{"$f":"IF(AT12=\"\",\"\",AT12)","v":""},{"$f":"IF(AV13=\"\",\"\",AV13)","v":""},":",{"$f":"IF(AT13=\"\",\"\",AT13)","v":""},{"$f":"IF(AV14=\"\",\"\",AV14)","v":""},":",{"$f":"IF(AT14=\"\",\"\",AT14)","v":""},{"$f":"IF(AV15=\"\",\"\",AV15)","v":""},":",{"$f":"IF(AT15=\"\",\"\",AT15)","v":""},{"$f":"IF(AV16=\"\",\"\",AV16)","v":""},":",{"$f":"IF(AT16=\"\",\"\",AT16)","v":""},{"$f":"IF(AV17=\"\",\"\",AV17)","v":""},":",{"$f":"IF(AT17=\"\",\"\",AT17)","v":""},{"$f":"IF(AV18=\"\",\"\",AV18)","v":""},":",{"$f":"IF(AT18=\"\",\"\",AT18)","v":""},null,null,null,0,0,0,0,0,":",0,0,{"$f":"IF(D19=\"\",\"\",IF(D19>F19,3,IF(D19=F19,1,0)))","v":""},{"$f":"IF(G19=\"\",\"\",IF(G19>I19,3,IF(G19=I19,1,0)))","v":""},{"$f":"IF(J19=\"\",\"\",IF(J19>L19,3,IF(J19=L19,1,0)))","v":""},{"$f":"IF(M19=\"\",\"\",IF(M19>O19,3,IF(M19=O19,1,0)))","v":""},{"$f":"IF(P19=\"\",\"\",IF(P19>R19,3,IF(P19=R19,1,0)))","v":""},"","","","",{"$f":"IF(AE19=\"\",\"\",IF(AE19>AG19,3,IF(AE19=AG19,1,0)))","v":""},{"$f":"IF(AH19=\"\",\"\",IF(AH19>AJ19,3,IF(AH19=AJ19,1,0)))","v":""},{"$f":"IF(AK19=\"\",\"\",IF(AK19>AM19,3,IF(AK19=AM19,1,0)))","v":""},"","","vyrovnané","vynikající"]
[]
[null,null,"   O PŘEPNUTÍ MEZI TABULKAMI SI ŘEKNĚTE U OBSLUHY PC         TOTO NENÍ DOTYKOVÁ OBRAZOVKA"]
[]
[null,null,null,null,"V tabulce musí být prázdný řádek a sloupec"]

{"sheet":"Pořadí 4","index":6,"n_rows":20,"n_cols":22,"rows_kept":20,"cut":false,"hidden":false,"merged":[[0,0,0,10],[1,6,1,8]]}
[{"$f":"'SKUPINA 4'!$A$1","v":"SKUPINA 4 hlavního turnaje v kategorii U9"}]
[null,null,"Utkání celkem","Vítězství","Remízy","Prohry","Skóre",null,null,"Rozdíl","Body","Hodnocení skóre","Hodnocení družstva"]
[13,{"$f":"'SKUPINA 4'!C6","v":"FKM Vysočina Jihlava"},{"$f":"SUM('SKUPINA 4'!AW6,Jaro!BE5)","v":3},{"$f":"SUM('SKUPINA 4'!AX6,Jaro!BF5)","v":2},{"$f":"SUM('SKUPINA 4'!AY6,Jaro!BG5)","v":1},{"$f":"SUM('SKUPINA 4'!AZ6,Jaro!BH5)","v":0},{"$f":"SUM('SKUPINA 4'!BA6,Jaro!BI5)","v":20},":",{"$f":"SUM('SKUPINA 4'!BC6,Jaro!BK5)","v":10},{"$f":"SUM(G3-I3)","v":10},{"$f":"SUM('SKUPINA 4'!BD6,Jaro!BL5)","v":7},{"$f":"IF(G5>I5,\"aktivní\",IF(G5=I5,\"vyrovnané\",\"pasivní\"))","v":"pasivní"},{"$f":"IF(K5>=80/100*C5*3,\"vynikající\",IF(K5<50/100*C5*3,\"neúspěšné\",\"dobré\"))","v":"neúspěšné"}]
[14,{"$f":"'SKUPINA 4'!C5","v":"CU Bohemians Praha"},{"$f":"SUM('SKUPINA 4'!AW5,Jaro!BE4)","v":3},{"$f":"SUM('SKUPINA 4'!AX5,Jaro!BF4)","v":1},{"$f":"SUM('SKUPINA 4'!AY5,Jaro!BG4)","v":2},{"$f":"SUM('SKUPINA 4'!AZ5,Jaro!BH4)","v":0},{"$f":"SUM('SKUPINA 4'!BA5,Jaro!BI4)","v":8},":",{"$f":"SUM('SKUPINA 4'!BC5,Jaro!BK4)","v":7},{"$f":"SUM(G4-I4)","v":1},{"$f":"SUM('SKUPINA 4'!BD5,Jaro!BL4)","v":5},{"$f":"IF(G6>I6,\"aktivní\",IF(G6=I6,\"vyrovnané\",\"pasivní\"))","v":"pasivní"},{"$f":"IF(K6>=80/100*C6*3,\"vynikající\",IF(K6<50/100*C6*3,\"neúspěšné\",\"dobré\"))","v":"neúspěšné"}]
[15,{"$f":"'SKUPINA 4'!C7","v":"RMSK \"Cidlina\" Nový Bydžov"},{"$f":"SUM('SKUPINA 4'!AW7,Jaro!BE6)","v":3},{"$f":"SUM('SKUPINA 4'!AX7,Jaro!BF6)","v":1},{"$f":"SUM('SKUPINA 4'!AY7,Jaro!BG6)","v":1},{"$f":"SUM('SKUPINA 4'!AZ7,Jaro!BH6)","v":1},{"$f":"SUM('SKUPINA 4'!BA7,Jaro!BI6)","v":13},":",{"$f":"SUM('SKUPINA 4'!BC7,Jaro!BK6)","v":17},{"$f":"SUM(G5-I5)","v":-4},{"$f":"SUM('SKUPINA 4'!BD7,Jaro!BL6)","v":4},{"$f":"IF(G7>I7,\"aktivní\",IF(G7=I7,\"vyrovnané\",\"pasivní\"))","v":"vyrovnané"},{"$f":"IF(K7>=80/100*C7*3,\"vynikající\",IF(K7<50/100*C7*3,\"neúspěšné\",\"dobré\"))","v":"vynikající"}]
[16,{"$f":"'SKUPINA 4'!C8","v":"FK Pardubice"},{"$f":"SUM('SKUPINA 4'!AW8,Jaro!BE7)","v":3},{"$f":"SUM('SKUPINA 4'!AX8,Jaro!BF7)","v":0},{"$f":"SUM('SKUPINA 4'!AY8,Jaro!BG7)","v":0},{"$f":"SUM('SKUPINA 4'!AZ8,Jaro!BH7)","v":3},{"$f":"SUM('SKUPINA 4'!BA8,Jaro!BI7)","v":7},":",{"$f":"SUM('SKUPINA 4'!BC8,Jaro!BK7)","v":14},{"$f":"SUM(G6-I6)","v":-7},{"$f":"SUM('SKUPINA 4'!BD8,Jaro!BL7)","v":0},{"$f":"IF(G8>I8,\"aktivní\",IF(G8=I8,\"vyrovnané\",\"pasivní\"))","v":"vyrovnané"},{"$f":"IF(K8>=80/100*C8*3,\"vynikající\",IF(K8<50/100*C8*3,\"neúspěšné\",\"dobré\"))","v":"vynikající"}]
[5,{"$f":"'SKUPINA 4'!C9","v":5},{"$f":"SUM('SKUPINA 4'!AW9,Jaro!BE8)","v":0},{"$f":"SUM('SKUPINA 4'!AX11,Jaro!BF10)","v":0},{"$f":"SUM('SKUPINA 4'!AY9,Jaro!BG8)","v":0},{"$f":"SUM('SKUPINA 4'!AZ9,Jaro!BH8)","v":0},{"$f":"SUM('SKUPINA 4'!BA9,Jaro!BI8)","v":0},":",{"$f":"SUM('SKUPINA 4'!BC9,Jaro!BK8)","v":0},{"$f":"SUM(G7-I7)","v":0},{"$f":"SUM('SKUPINA 4'!BD9,Jaro!BL8)","v":0},{"$f":"IF(G9>I9,\"aktivní\",IF(G9=I9,\"vyrovnané\",\"pasivní\"))","v":"vyrovnané"},{"$f":"IF(K9>=80/100*C9*3,\"vynikající\",IF(K9<50/100*C9*3,\"neúspěšné\",\"dobré\"))","v":"vynikající"}]
[6,{"$f":"'SKUPINA 4'!C10","v":6},{"$f":"SUM('SKUPINA 4'!AW10,Jaro!BE9)","v":0},{"$f":"SUM('SKUPINA 4'!AX12,Jaro!BF11)","v":0},{"$f":"SUM('SKUPINA 4'!AY10,Jaro!BG9)","v":0},{"$f":"SUM('SKUPINA 4'!AZ10,Jaro!BH9)","v":0},{"$f":"SUM('SKUPINA 4'!BA10,Jaro!BI9)","v":0},":",{"$f":"SUM('SKUPINA 4'!BC10,Jaro!BK9)","v":0},{"$f":"SUM(G8-I8)","v":0},{"$f":"SUM('SKUPINA 4'!BD10,Jaro!BL9)","v":0},{"$f":"IF(G10>I10,\"aktivní\",IF(G10=I10,\"vyrovnané\",\"pasivní\"))","v":"vyrovnané"},{"$f":"IF(K10>=80/100*C10*3,\"vynikající\",IF(K10<50/100*C10*3,\"neúspěšné\",\"dobré\"))","v":"vynikající"}]
[6,{"$f":"'SKUPINA 4'!C11","v":7},{"$f":"SUM('SKUPINA 4'!AW11,Jaro!BE10)","v":0},{"$f":"SUM('SKUPINA 4'!AX13,Jaro!BF12)","v":0},{"$f":"SUM('SKUPINA 4'!AY11,Jaro!BG10)","v":0},{"$f":"SUM('SKUPINA 4'!AZ11,Jaro!BH10)","v":0},{"$f":"SUM('SKUPINA 4'!BA11,Jaro!BI10)","v":0},":",{"$f":"SUM('SKUPINA 4'!BC11,Jaro!BK10)","v":0},{"$f":"SUM(G9-I9)","v":0},{"$f":"SUM('SKUPINA 4'!BD11,Jaro!BL10)","v":0},{"$f":"IF(G11>I11,\"aktivní\",IF(G11=I11,\"vyrovnané\",\"pasivní\"))","v":"vyrovnané"},{"$f":"IF(K11>=80/100*C11*3,\"vynikající\",IF(K11<50/100*C11*3,\"neúspěšné\",\"dobré\"))","v":"vynikající"}]
[7,{"$f":"'SKUPINA 4'!C12","v":8},{"$f":"SUM('SKUPINA 4'!AW12,Jaro!BE11)","v":0},{"$f":"SUM('SKUPINA 4'!AX14,Jaro!BF13)","v":0},{"$f":"SUM('SKUPINA 4'!AY12,Jaro!BG11)","v":0},{"$f":"SUM('SKUPINA 4'!AZ12,Jaro!BH11)","v":0},{"$f":"SUM('SKUPINA 4'!BA12,Jaro!BI11)","v":0},":",{"$f":"SUM('SKUPINA 4'!BC12,Jaro!BK11)","v":0},{"$f":"SUM(G10-I10)","v":0},{"$f":"SUM('SKUPINA 4'!BD12,Jaro!BL11)","v":0},{"$f":"IF(G12>I12,\"aktivní\",IF(G12=I12,\"vyrovnané\",\"pasivní\"))","v":"vyrovnané"},{"$f":"IF(K12>=80/100*C12*3,\"vynikající\",IF(K12<50/100*C12*3,\"neúspěšné\",\"dobré\"))","v":"vynikající"}]
[8,{"$f":"'SKUPINA 4'!C13","v":9},{"$f":"SUM('SKUPINA 4'!AW13,Jaro!BE12)","v":0},{"$f":"SUM('SKUPINA 4'!AX15,Jaro!BF14)","v":0},{"$f":"SUM('SKUPINA 4'!AY13,Jaro!BG12)","v":0},{"$f":"SUM('SKUPINA 4'!AZ13,Jaro!BH12)","v":0},{"$f":"SUM('SKUPINA 4'!BA13,Jaro!BI12)","v":0},":",{"$f":"SUM('SKUPINA 4'!BC13,Jaro!BK12)","v":0},{"$f":"SUM(G11-I11)","v":0},{"$f":"SUM('SKUPINA 4'!BD13,Jaro!BL12)","v":0},{"$f":"IF(G13>I13,\"aktivní\",IF(G13=I13,\"vyrovnané\",\"pasivní\"))","v":"vyrovnané"},{"$f":"IF(K13>=80/100*C13*3,\"vynikající\",IF(K13<50/100*C13*3,\"neúspěšné\",\"dobré\"))","v":"vynikající"}]
[9,{"$f":"'SKUPINA 4'!C14","v":10},{"$f":"SUM('SKUPINA 4'!AW14,Jaro!BE13)","v":0},{"$f":"SUM('SKUPINA 4'!AX16,Jaro!BF15)","v":0},{"$f":"SUM('SKUPINA 4'!AY14,Jaro!BG13)","v":0},{"$f":"SUM('SKUPINA 4'!AZ14,Jaro!BH13)","v":0},{"$f":"SUM('SKUPINA 4'!BA14,Jaro!BI13)","v":0},":",{"$f":"SUM('SKUPINA 4'!BC14,Jaro!BK13)","v":0},{"$f":"SUM(G12-I12)","v":0},{"$f":"SUM('SKUPINA 4'!BD14,Jaro!BL13)","v":0},{"$f":"IF(G14>I14,\"aktivní\",IF(G14=I14,\"vyrovnané\",\"pasivní\"))","v":"vyrovnané"},{"$f":"IF(K14>=80/100*C14*3,\"vynikající\",IF(K14<50/100*C14*3,\"neúspěšné\",\"dobré\"))","v":"vynikající"},null,null,null,null,null,null,null,null,"´´"]
[10,{"$f":"'SKUPINA 4'!C15","v":11},{"$f":"SUM('SKUPINA 4'!AW15,Jaro!BE14)","v":0},{"$f":"SUM('SKUPINA 4'!AX17,Jaro!BF16)","v":0},{"$f":"SUM('SKUPINA 4'!AY15,Jaro!BG14)","v":0},{"$f":"SUM('SKUPINA 4'!AZ15,Jaro!BH14)","v":0},{"$f":"SUM('SKUPINA 4'!BA15,Jaro!BI14)","v":0},":",{"$f":"SUM('SKUPINA 4'!BC15,Jaro!BK14)","v":0},{"$f":"SUM(G13-I13)","v":0},{"$f":"SUM('SKUPINA 4'!BD15,Jaro!BL14)","v":0},{"$f":"IF(G15>I15,\"aktivní\",IF(G15=I15,\"vyrovnané\",\"pasivní\"))","v":"vyrovnané"},{"$f":"IF(K15>=80/100*C15*3,\"vynikající\",IF(K15<50/100*C15*3,\"neúspěšné\",\"dobré\"))","v":"vynikající"}]
[11,{"$f":"'SKUPINA 4'!C16","v":12},{"$f":"SUM('SKUPINA 4'!AW16,Jaro!BE15)","v":0},{"$f":"SUM('SKUPINA 4'!AX18,Jaro!BF17)","v":0},{"$f":"SUM('SKUPINA 4'!AY16,Jaro!BG15)","v":0},{"$f":"SUM('SKUPINA 4'!AZ16,Jaro!BH15)","v":0},{"$f":"SUM('SKUPINA 4'!BA16,Jaro!BI15)","v":0},":",{"$f":"SUM('SKUPINA 4'!BC16,Jaro!BK15)","v":0},{"$f":"SUM(G14-I14)","v":0},{"$f":"SUM('SKUPINA 4'!BD16,Jaro!BL15)","v":0},{"$f":"IF(G16>I16,\"aktivní\",IF(G16=I16,\"vyrovnané\",\"pasivní\"))","v":"vyrovnané"},{"$f":"IF(K16>=80/100*C16*3,\"vynikající\",IF(K16<50/100*C16*3,\"neúspěšné\",\"dobré\"))","v":"vynikající"}]
[13,{"$f":"'SKUPINA 4'!C17","v":13},{"$f":"SUM('SKUPINA 4'!AW17,Jaro!BE16)","v":0},{"$f":"SUM('SKUPINA 4'!AX6,Jaro!BF5)","v":2},{"$f":"SUM('SKUPINA 4'!AY17,Jaro!BG16)","v":0},{"$f":"SUM('SKUPINA 4'!AZ17,Jaro!BH16)","v":0},{"$f":"SUM('SKUPINA 4'!BA17,Jaro!BI16)","v":0},":",{"$f":"SUM('SKUPINA 4'!BC17,Jaro!BK16)","v":0},{"$f":"SUM(G15-I15)","v":0},{"$f":"SUM('SKUPINA 4'!BD17,Jaro!BL16)","v":0},{"$f":"IF(G17>I17,\"aktivní\",IF(G17=I17,\"vyrovnané\",\"pasivní\"))","v":"vyrovnané"},{"$f":"IF(K17>=80/100*C17*3,\"vynikající\",IF(K17<50/100*C17*3,\"neúspěšné\",\"dobré\"))","v":"vynikající"}]
[14,{"$f":"'SKUPINA 4'!C18","v":14},{"$f":"SUM('SKUPINA 4'!AW18,Jaro!BE17)","v":0},{"$f":"SUM('SKUPINA 4'!AX7,Jaro!BF6)","v":1},{"$f":"SUM('SKUPINA 4'!AY18,Jaro!BG17)","v":0},{"$f":"SUM('SKUPINA 4'!AZ18,Jaro!BH17)","v":0},{"$f":"SUM('SKUPINA 4'!BA18,Jaro!BI17)","v":0},":",{"$f":"SUM('SKUPINA 4'!BC18,Jaro!BK17)","v":0},{"$f":"SUM(G16-I16)","v":0},{"$f":"SUM('SKUPINA 4'!BD18,Jaro!BL17)","v":0},{"$f":"IF(G18>I18,\"aktivní\",IF(G18=I18,\"vyrovnané\",\"pasivní\"))","v":"vyrovnané"},{"$f":"IF(K18>=80/100*C18*3,\"vynikající\",IF(K18<50/100*C18*3,\"neúspěšné\",\"dobré\"))","v":"vynikající"}]
[]
[]
[]
[null,"TOTO NENÍ DOTYKOVÁ OBRAZOVKA"]

{"sheet":"SKUPINA 5","index":7,"n_rows":23,"n_cols":76,"rows_kept":23,"cut":false,"hidden":false,"merged":[[1,45,1,47],[0,0,0,55],[1,3,1,5],[1,6,1,8],[1,9,1,11],[1,12,1,14],[1,15,1,17],[1,18,1,20],[1,21,1,23],[1,24,1,26],[1,27,1,29],[1,30,1,32],[1,33,1,35],[1,36,1,38],[1,39,1,41],[1,42,1,44],[1,70,3,70],[1,71,3,71],[3,3,3,5],[3,6,3,8],[3,9,3,11],[3,12,3,14],[3,15,3,17],[3,18,3,20],[3,21,3,23],[3,24,3,26],[1,48,3,48],[1,49,3,49],[1,50,3,50],[1,51,3,51],[1,52,3,54],[1,55,3,55],[8,15,8,17],[3,27,3,29],[3,30,3,32],[3,33,3,35],[3,36,3,38],[3,45,3,47],[4,3,4,5],[5,6,5,8],[6,9,6,11],[7,12,7,14],[3,39,3,41],[3,42,3,44],[15,36,15,38],[16,39,16,41],[17,42,17,44],[18,45,18,47],[9,18,9,20],[10,21,10,23],[11,24,11,26],[12,27,12,29],[13,30,13,32],[14,33,14,35]]}
["SKUPINA 5 hlavního turnaje v kategorii U9",null,null,null,null,null,null,null,null,null,null,null,null,null,null,null,null,null,null,null,null,null,null,null,null,null,null,null,null,null,null,null,null,null,null,null,null,null,null,null,null,null,null,null,null,null,null,null,null,null,null,null,null,null,null,null,null,null,null,null,null,null,null,null,null,null,null,null,null,null,null,null,"  "," "," ","  "]
[null,null,null,"A1",null,null,"A2",null,null,"A3",null,null,"A4",null,null,"A5",null,null,"A6",null,null,"A7",null,null,"A8",null,null,"A9",null,null,"A10",null,null,"A11",null,null,"A12",null,null,"A13",null,null,"A14",null,null,"A15",null,null,"Utkání celkem","Vítězství","Remízy","Prohry","Skóre",null,null,"Body",null,null,null,null,null,null,null,null,null,null,null,null,null,null,"Hodnocení skóre","Hodnocení družstva"]
[null,null,null,null,0,null,null,0,null,null,0,null,null,0,null,null,0,null,null,0,null,null,0,null,null,0,null,null,0,null,null,0,null,null,0,null,null,0,null,null,0,null,null,0,null,null,0]
[null,null,null,{"$f":"C5","v":"1. FC Poruba"},null,null,{"$f":"C6","v":"TJ Praga Vysočany"},null,null,{"$f":"C7","v":"SK Benešov"},null,null,{"$f":"C8","v":"FC Hradec Králové"},null,null,{"$f":"C9","v":5},null,null,{"$f":"C10","v":6},null,null,7,null,null,8,null,null,9,null,null,10,null,null,11,null,null,12,null,null,{"$f":"C17","v":13},null,null,{"$f":"C18","v":14},null,null,{"$f":"C19","v":15},null,null,null,null,null,null,null,null,null,null,2,3,4,5,6,7,8,9,10,11,12,13,14,15]
["A1",null,"1. FC Poruba",null,null,null,3,":",4,2,":",3,3,":",4,null,":",null,null,":",null,null,":",null,null,":",null,null,":",null,null,":",null,null,":",null,null,":",null,null,":",null,null,":",null,null,":",null,{"$f":"COUNT(BE5:BR5)","v":3},{"$f":"COUNTIF(BE5:BR5,3)","v":0},{"$f":"COUNTIF(BE5:BR5,1)","v":0},{"$f":"COUNTIF(BE5:BR5,0)","v":3},{"$f":"SUM(D5,G5,J5,M5,P5,S5)","v":8},":",{"$f":"SUM(F5,I5,L5,O5,R5,U5)","v":11},{"$f":"SUM(BE5:BR5)","v":0},{"$f":"IF(G5=\"\",\"\",IF(G5>I5,3,IF(G5=I5,1,0)))","v":0},{"$f":"IF(J5=\"\",\"\",IF(J5>L5,3,IF(J5=L5,1,0)))","v":0},{"$f":"IF(M5=\"\",\"\",IF(M5>O5,3,IF(M5=O5,1,0)))","v":0},{"$f":"IF(P5=\"\",\"\",IF(P5>R5,3,IF(P5=R5,1,0)))","v":""},{"$f":"IF(S5=\"\",\"\",IF(S5>U5,3,IF(S5=U5,1,0)))","v":""},{"$f":"IF(V5=\"\",\"\",IF(V5>X5,3,IF(V5=X5,1,0)))","v":""},{"$f":"IF(Y5=\"\",\"\",IF(Y5>AA5,3,IF(Y5=AA5,1,0)))","v":""},{"$f":"IF(AB5=\"\",\"\",IF(AB5>AD5,3,IF(AB5=AD5,1,0)))","v":""},{"$f":"IF(AE5=\"\",\"\",IF(AE5>AG5,3,IF(AE5=AG5,1,0)))","v":""},{"$f":"IF(AH5=\"\",\"\",IF(AH5>AJ5,3,IF(AH5=AJ5,1,0)))","v":""},{"$f":"IF(AK5=\"\",\"\",IF(AK5>AM5,3,IF(AK5=AM5,1,0)))","v":""},{"$f":"IF(AN5=\"\",\"\",IF(AN5>AP5,3,IF(AN5=AP5,1,0)))","v":""},{"$f":"IF(AQ5=\"\",\"\",IF(AQ5>AS5,3,IF(AQ5=AS5,1,0)))","v":""},{"$f":"IF(AT5=\"\",\"\",IF(AT5>AV5,3,IF(AT5=AV5,1,0)))","v":""},{"$f":"IF(BA5>BC5,\"aktivní\",IF(BA5=BC5,\"vyrovnané\",\"pasivní\"))","v":"pasivní"},{"$f":"IF(BD5>=80/100*AW5*3,\"vynikající\",IF(BD5<50/100*AW5*3,\"neúspěšné\",\"dobré\"))","v":"neúspěšné"}]
["A2",null,"TJ Praga Vysočany",{"$f":"IF(I5=\"\",\"\",I5)","v":4},":",{"$f":"IF(G5=\"\",\"\",G5)","v":3},null,null,null,3,":",3,2,":",3,null,":",null,null,":",null,null,":",null,null,":",null,null,":",null,null,":",null,null,":",null,null,":",null,null,":",null,null,":",null,null,":",null,3,{"$f":"COUNTIF(BE6:BR6,3)","v":1},1,{"$f":"COUNTIF(BE6:BR6,0)","v":1},{"$f":"SUM(D6,G6,J6,M6,P6,S6)","v":9},":",{"$f":"SUM(F6,I6,L6,O6,R6,U6)","v":9},{"$f":"SUM(BE6:BR6)","v":4},{"$f":"IF(D6=\"\",\"\",IF(D6>F6,3,IF(D6=F6,1,0)))","v":3},{"$f":"IF(J6=\"\",\"\",IF(J6>L6,3,IF(J6=L6,1,0)))","v":1},{"$f":"IF(M6=\"\",\"\",IF(M6>O6,3,IF(M6=O6,1,0)))","v":0},{"$f":"IF(P6=\"\",\"\",IF(P6>R6,3,IF(P6=R6,1,0)))","v":""},{"$f":"IF(S6=\"\",\"\",IF(S6>U6,3,IF(S6=U6,1,0)))","v":""},"","","","","","",{"$f":"IF(AN6=\"\",\"\",IF(AN6>AP6,3,IF(AN6=AP6,1,0)))","v":""},{"$f":"IF(AQ6=\"\",\"\",IF(AQ6>AS6,3,IF(AQ6=AS6,1,0)))","v":""},{"$f":"IF(AT6=\"\",\"\",IF(AT6>AV6,3,IF(AT6=AV6,1,0)))","v":""},"vyrovnané","neúspěšné"]
["A3",null,"SK Benešov",{"$f":"IF(L5=\"\",\"\",L5)","v":3},":",{"$f":"IF(J5=\"\",\"\",J5)","v":2},{"$f":"IF(L6=\"\",\"\",L6)","v":3},":",{"$f":"IF(J6=\"\",\"\",J6)","v":3},null,null,null,2,":",3,null,":",null,null,":",null,null,":",null,null,":",null,null,":",null,null,":",null,null,":",null,null,":",null,null,":",null,null,":",null,null,":",null,3,1,1,1,8,":",8,{"$f":"SUM(BE7:BR7)","v":4},{"$f":"IF(D7=\"\",\"\",IF(D7>F7,3,IF(D7=F7,1,0)))","v":3},{"$f":"IF(G7=\"\",\"\",IF(G7>I7,3,IF(G7=I7,1,0)))","v":1},{"$f":"IF(M7=\"\",\"\",IF(M7>O7,3,IF(M7=O7,1,0)))","v":0},{"$f":"IF(P7=\"\",\"\",IF(P7>R7,3,IF(P7=R7,1,0)))","v":""},{"$f":"IF(S7=\"\",\"\",IF(S7>U7,3,IF(S7=U7,1,0)))","v":""},"","","","","","","","","","vyrovnané","neúspěšné"]
["A4",null,"FC Hradec Králové",{"$f":"IF(O5=\"\",\"\",O5)","v":4},":",{"$f":"IF(M5=\"\",\"\",M5)","v":3},{"$f":"IF(O6=\"\",\"\",O6)","v":3},":",{"$f":"IF(M6=\"\",\"\",M6)","v":2},{"$f":"IF(O7=\"\",\"\",O7)","v":3},":",{"$f":"IF(M7=\"\",\"\",M7)","v":2},null,null,null,null,":",null,null,":",null,null,":",null,null,":",null,null,":",null,null,":",null,null,":",null,null,":",null,null,":",null,null,":",null,null,":",null,3,3,0,0,10,":",7,{"$f":"SUM(BE8:BR8)","v":9},3,3,{"$f":"IF(J8=\"\",\"\",IF(J8>L8,3,IF(J8=L8,1,0)))","v":3},{"$f":"IF(P8=\"\",\"\",IF(P8>R8,3,IF(P8=R8,1,0)))","v":""},{"$f":"IF(S8=\"\",\"\",IF(S8>U8,3,IF(S8=U8,1,0)))","v":""},"","","","","","","","","","aktivní","vynikající"]
["A5",null,5,{"$f":"IF(R5=\"\",\"\",R5)","v":""},":",{"$f":"IF(P5=\"\",\"\",P5)","v":""},{"$f":"IF(R6=\"\",\"\",R6)","v":""},":",{"$f":"IF(P6=\"\",\"\",P6)","v":""},{"$f":"IF(R7=\"\",\"\",R7)","v":""},":",{"$f":"IF(P7=\"\",\"\",P7)","v":""},{"$f":"IF(R8=\"\",\"\",R8)","v":""},":",{"$f":"IF(P8=\"\",\"\",P8)","v":""},null,null,null,null,":",null,null,":",null,null,":",null,null,":",null,null,":",null,null,":",null,null,":",null,null,":",null,null,":",null,null,":",null,0,0,0,0,0,":",0,{"$f":"SUM(BE9:BR9)","v":0},"","",{"$f":"IF(J9=\"\",\"\",IF(J9>L9,3,IF(J9=L9,1,0)))","v":""},{"$f":"IF(M9=\"\",\"\",IF(M9>O9,3,IF(M9=O9,1,0)))","v":""},{"$f":"IF(S9=\"\",\"\",IF(S9>U9,3,IF(S9=U9,1,0)))","v":""},"","","","","","","","","","vyrovnané","vynikající"]
["A6",null,6,{"$f":"IF(U5=\"\",\"\",U5)","v":""},":",{"$f":"IF(S5=\"\",\"\",S5)","v":""},{"$f":"IF(U6=\"\",\"\",U6)","v":""},":",{"$f":"IF(S6=\"\",\"\",S6)","v":""},{"$f":"IF(U7=\"\",\"\",U7)","v":""},":",{"$f":"IF(S7=\"\",\"\",S7)","v":""},{"$f":"IF(U8=\"\",\"\",U8)","v":""},":",{"$f":"IF(S8=\"\",\"\",S8)","v":""},{"$f":"IF(U9=\"\",\"\",U9)","v":""},":",{"$f":"IF(S9=\"\",\"\",S9)","v":""},null,null,null,null,":",null,null,":",null,null,":",null,null,":",null,null,":",null,null,":",null,null,":",null,null,":",null,null,":",null,0,0,0,0,0,":",0,{"$f":"SUM(BE10:BR10)","v":0},"","","",{"$f":"IF(M10=\"\",\"\",IF(M10>O10,3,IF(M10=O10,1,0)))","v":""},{"$f":"IF(P10=\"\",\"\",IF(P10>R10,3,IF(P10=R10,1,0)))","v":""},"","","","","","","","","","vyrovnané","vynikající"]
["A7",null,7,{"$f":"IF(X5=\"\",\"\",X5)","v":""},":",{"$f":"IF(V5=\"\",\"\",V5)","v":""},{"$f":"IF(X6=\"\",\"\",X6)","v":""},":",{"$f":"IF(V6=\"\",\"\",V6)","v":""},{"$f":"IF(X7=\"\",\"\",X7)","v":""},":",{"$f":"IF(V7=\"\",\"\",V7)","v":""},{"$f":"IF(X8=\"\",\"\",X8)","v":""},":",{"$f":"IF(V8=\"\",\"\",V8)","v":""},{"$f":"IF(X9=\"\",\"\",X9)","v":""},":",{"$f":"IF(V9=\"\",\"\",V9)","v":""},{"$f":"IF(X10=\"\",\"\",X10)","v":""},":",{"$f":"IF(V10=\"\",\"\",V10)","v":""},null,null,null,null,":",null,null,":",null,null,":",null,null,":",null,null,":",null,null,":",null,null,":",null,null,":",null,0,0,0,0,{"$f":"SUM(D11,G11,J11,M11,P11,S11,V11,Y11,AB11,AE11,AH11,AK11,AN11,AQ11)","v":0},":",{"$f":"SUM(F11,I11,L11,O11,R11,U11,X11,AA11,AD11,AG11,AJ11,AM11,AP11,AS11)","v":0},0,"","","","","",{"$f":"IF(S11=\"\",\"\",IF(S11>U11,3,IF(S11=U11,1,0)))","v":""},"","","","","","","","","vyrovnané","vynikající"]
["A8",null,8,{"$f":"IF(AA5=\"\",\"\",AA5)","v":""},":",{"$f":"IF(Y5=\"\",\"\",Y5)","v":""},{"$f":"IF(AA6=\"\",\"\",AA6)","v":""},":",{"$f":"IF(Y6=\"\",\"\",Y6)","v":""},{"$f":"IF(AA7=\"\",\"\",AA7)","v":""},":",{"$f":"IF(Y7=\"\",\"\",Y7)","v":""},{"$f":"IF(AA8=\"\",\"\",AA8)","v":""},":",{"$f":"IF(Y8=\"\",\"\",Y8)","v":""},{"$f":"IF(AA9=\"\",\"\",AA9)","v":""},":",{"$f":"IF(Y9=\"\",\"\",Y9)","v":""},{"$f":"IF(AA10=\"\",\"\",AA10)","v":""},":",{"$f":"IF(Y10=\"\",\"\",Y10)","v":""},{"$f":"IF(AA11=\"\",\"\",AA11)","v":""},":",{"$f":"IF(Y11=\"\",\"\",Y11)","v":""},null,null,null,null,":",null,null,":",null,null,":",null,null,":",null,null,":",null,null,":",null,null,":",null,0,0,0,0,0,":",0,0,"","","","","","",{"$f":"IF(V12=\"\",\"\",IF(V12>X12,3,IF(V12=X12,1,0)))","v":""},{"$f":"IF(AB12=\"\",\"\",IF(AB12>AD12,3,IF(AB12=AD12,1,0)))","v":""},"","","","","","","vyrovnané","vynikající"]
["A9",null,9,{"$f":"IF(AD5=\"\",\"\",AD5)","v":""},":",{"$f":"IF(AB5=\"\",\"\",AB5)","v":""},{"$f":"IF(AD6=\"\",\"\",AD6)","v":""},":",{"$f":"IF(AB6=\"\",\"\",AB6)","v":""},{"$f":"IF(AD7=\"\",\"\",AD7)","v":""},":",{"$f":"IF(AB7=\"\",\"\",AB7)","v":""},{"$f":"IF(AD8=\"\",\"\",AD8)","v":""},":",{"$f":"IF(AB8=\"\",\"\",AB8)","v":""},{"$f":"IF(AD9=\"\",\"\",AD9)","v":""},":",{"$f":"IF(AB9=\"\",\"\",AB9)","v":""},{"$f":"IF(AD10=\"\",\"\",AD10)","v":""},":",{"$f":"IF(AB10=\"\",\"\",AB10)","v":""},{"$f":"IF(AD11=\"\",\"\",AD11)","v":""},":",{"$f":"IF(AB11=\"\",\"\",AB11)","v":""},{"$f":"IF(AD12=\"\",\"\",AD12)","v":""},":",{"$f":"IF(AB12=\"\",\"\",AB12)","v":""},null,null,null,null,":",null,null,":",null,null,":",null,null,":",null,null,":",null,null,":",null,0,0,0,0,0,":",0,0,"","","","","","","",{"$f":"IF(Y13=\"\",\"\",IF(Y13>AA13,3,IF(Y13=AA13,1,0)))","v":""},{"$f":"IF(AE13=\"\",\"\",IF(AE13>AG13,3,IF(AE13=AG13,1,0)))","v":""},"","","","","","vyrovnané","vynikající"]
["A10",null,10,{"$f":"IF(AG5=\"\",\"\",AG5)","v":""},":",{"$f":"IF(AE5=\"\",\"\",AE5)","v":""},{"$f":"IF(AG6=\"\",\"\",AG6)","v":""},":",{"$f":"IF(AE6=\"\",\"\",AE6)","v":""},{"$f":"IF(AG7=\"\",\"\",AG7)","v":""},":",{"$f":"IF(AE7=\"\",\"\",AE7)","v":""},{"$f":"IF(AG8=\"\",\"\",AG8)","v":""},":",{"$f":"IF(AE8=\"\",\"\",AE8)","v":""},{"$f":"IF(AG9=\"\",\"\",AG9)","v":""},":",{"$f":"IF(AE9=\"\",\"\",AE9)","v":""},{"$f":"IF(AG10=\"\",\"\",AG10)","v":""},":",{"$f":"IF(AE10=\"\",\"\",AE10)","v":""},{"$f":"IF(AG11=\"\",\"\",AG11)","v":""},":",{"$f":"IF(AE11=\"\",\"\",AE11)","v":""},{"$f":"IF(AG12=\"\",\"\",AG12)","v":""},":",{"$f":"IF(AE12=\"\",\"\",AE12)","v":""},{"$f":"IF(AG13=\"\",\"\",AG13)","v":""},":",{"$f":"IF(AE13=\"\",\"\",AE13)","v":""},null,null,null,null,":",null,null,":",null,null,":",null,null,":",null,null,":",null,0,0,0,0,0,":",0,0,"","","","","","","","",{"$f":"IF(AB14=\"\",\"\",IF(AB14>AD14,3,IF(AB14=AD14,1,0)))","v":""},{"$f":"IF(AH14=\"\",\"\",IF(AH14>AJ14,3,IF(AH14=AJ14,1,0)))","v":""},"","","","","vyrovnané","vynikající"]
["A11",null,11,{"$f":"IF(AJ5=\"\",\"\",AJ5)","v":""},":",{"$f":"IF(AH5=\"\",\"\",AH5)","v":""},{"$f":"IF(AJ6=\"\",\"\",AJ6)","v":""},":",{"$f":"IF(AH6=\"\",\"\",AH6)","v":""},{"$f":"IF(AJ7=\"\",\"\",AJ7)","v":""},":",{"$f":"IF(AH7=\"\",\"\",AH7)","v":""},{"$f":"IF(AJ8=\"\",\"\",AJ8)","v":""},":",{"$f":"IF(AH8=\"\",\"\",AH8)","v":""},{"$f":"IF(AJ9=\"\",\"\",AJ9)","v":""},":",{"$f":"IF(AH9=\"\",\"\",AH9)","v":""},{"$f":"IF(AJ10=\"\",\"\",AJ10)","v":""},":",{"$f":"IF(AH10=\"\",\"\",AH10)","v":""},{"$f":"IF(AJ11=\"\",\"\",AJ11)","v":""},":",{"$f":"IF(AH11=\"\",\"\",AH11)","v":""},{"$f":"IF(AJ12=\"\",\"\",AJ12)","v":""},":",{"$f":"IF(AH12=\"\",\"\",AH12)","v":""},{"$f":"IF(AJ13=\"\",\"\",AJ13)","v":""},":",{"$f":"IF(AH13=\"\",\"\",AH13)","v":""},{"$f":"IF(AJ14=\"\",\"\",AJ14)","v":""},":",{"$f":"IF(AH14=\"\",\"\",AH14)","v":""},null,null,null,null,":",null,null,":",null,null,":",null,null,":",null,0,0,0,0,0,":",0,0,"","","","","","","","","",{"$f":"IF(AE15=\"\",\"\",IF(AE15>AG15,3,IF(AE15=AG15,1,0)))","v":""},{"$f":"IF(AK15=\"\",\"\",IF(AK15>AM15,3,IF(AK15=AM15,1,0)))","v":""},"","","","vyrovnané","vynikající"]
["A12",null,12,{"$f":"IF(AM5=\"\",\"\",AM5)","v":""},":",{"$f":"IF(AK5=\"\",\"\",AK5)","v":""},{"$f":"IF(AM6=\"\",\"\",AM6)","v":""},":",{"$f":"IF(AK6=\"\",\"\",AK6)","v":""},{"$f":"IF(AM7=\"\",\"\",AM7)","v":""},":",{"$f":"IF(AK7=\"\",\"\",AK7)","v":""},{"$f":"IF(AM8=\"\",\"\",AM8)","v":""},":",{"$f":"IF(AK8=\"\",\"\",AK8)","v":""},{"$f":"IF(AM9=\"\",\"\",AM9)","v":""},":",{"$f":"IF(AK9=\"\",\"\",AK9)","v":""},{"$f":"IF(AM10=\"\",\"\",AM10)","v":""},":",{"$f":"IF(AK10=\"\",\"\",AK10)","v":""},{"$f":"IF(AM11=\"\",\"\",AM11)","v":""},":",{"$f":"IF(AK11=\"\",\"\",AK11)","v":""},{"$f":"IF(AM12=\"\",\"\",AM12)","v":""},":",{"$f":"IF(AK12=\"\",\"\",AK12)","v":""},{"$f":"IF(AM13=\"\",\"\",AM13)","v":""},":",{"$f":"IF(AK13=\"\",\"\",AK13)","v":""},{"$f":"IF(AM14=\"\",\"\",AM14)","v":""},":",{"$f":"IF(AK14=\"\",\"\",AK14)","v":""},{"$f":"IF(AM15=\"\",\"\",AM15)","v":""},":",{"$f":"IF(AK15=\"\",\"\",AK15)","v":""},null,null,null,null,":",null,null,":",null,null,":",null,0,0,0,0,0,":",0,0,"","","","","","","","","",{"$f":"IF(AE16=\"\",\"\",IF(AE16>AG16,3,IF(AE16=AG16,1,0)))","v":""},{"$f":"IF(AH16=\"\",\"\",IF(AH16>AJ16,3,IF(AH16=AJ16,1,0)))","v":""},{"$f":"IF(AN16=\"\",\"\",IF(AN16>AP16,3,IF(AN16=AP16,1,0)))","v":""},"","","vyrovnané","vynikající"]
["A13",null,13,{"$f":"IF(AP5=\"\",\"\",AP5)","v":""},":",{"$f":"IF(AN5=\"\",\"\",AN5)","v":""},{"$f":"IF(AP6=\"\",\"\",AP6)","v":""},":",{"$f":"IF(AN6=\"\",\"\",AN6)","v":""},{"$f":"IF(AP7=\"\",\"\",AP7)","v":""},":",{"$f":"IF(AN7=\"\",\"\",AN7)","v":""},{"$f":"IF(AP8=\"\",\"\",AP8)","v":""},":",{"$f":"IF(AN8=\"\",\"\",AN8)","v":""},{"$f":"IF(AP9=\"\",\"\",AP9)","v":""},":",{"$f":"IF(AN9=\"\",\"\",AN9)","v":""},{"$f":"IF(AP10=\"\",\"\",AP10)","v":""},":",{"$f":"IF(AN10=\"\",\"\",AN10)","v":""},{"$f":"IF(AP11=\"\",\"\",AP11)","v":""},":",{"$f":"IF(AN11=\"\",\"\",AN11)","v":""},{"$f":"IF(AP12=\"\",\"\",AP12)","v":""},":",{"$f":"IF(AN12=\"\",\"\",AN12)","v":""},{"$f":"IF(AP13=\"\",\"\",AP13)","v":""},":",{"$f":"IF(AN13=\"\",\"\",AN13)","v":""},{"$f":"IF(AP14=\"\",\"\",AP14)","v":""},":",{"$f":"IF(AN14=\"\",\"\",AN14)","v":""},{"$f":"IF(AP15=\"\",\"\",AP15)","v":""},":",{"$f":"IF(AN15=\"\",\"\",AN15)","v":""},{"$f":"IF(AP16=\"\",\"\",AP16)","v":""},":",{"$f":"IF(AN16=\"\",\"\",AN16)","v":""},null,null,null,null,":",null,null,":",null,0,0,0,0,0,":",0,0,"",{"$f":"IF(G17=\"\",\"\",IF(G17>I17,3,IF(G17=I17,1,0)))","v":""},{"$f":"IF(J17=\"\",\"\",IF(J17>L17,3,IF(J17=L17,1,0)))","v":""},{"$f":"IF(M17=\"\",\"\",IF(M17>O17,3,IF(M17=O17,1,0)))","v":""},{"$f":"IF(P17=\"\",\"\",IF(P17>R17,3,IF(P17=R17,1,0)))","v":""},"","","","",{"$f":"IF(AE17=\"\",\"\",IF(AE17>AG17,3,IF(AE17=AG17,1,0)))","v":""},{"$f":"IF(AH17=\"\",\"\",IF(AH17>AJ17,3,IF(AH17=AJ17,1,0)))","v":""},{"$f":"IF(AK17=\"\",\"\",IF(AK17>AM17,3,IF(AK17=AM17,1,0)))","v":""},"","","vyrovnané","vynikající"]
["A14",null,14,{"$f":"IF(AS5=\"\",\"\",AS5)","v":""},":",{"$f":"IF(AQ5=\"\",\"\",AQ5)","v":""},{"$f":"IF(AS6=\"\",\"\",AS6)","v":""},":",{"$f":"IF(AQ6=\"\",\"\",AQ6)","v":""},{"$f":"IF(AS7=\"\",\"\",AS7)","v":""},":",{"$f":"IF(AQ7=\"\",\"\",AQ7)","v":""},{"$f":"IF(AS8=\"\",\"\",AS8)","v":""},":",{"$f":"IF(AQ8=\"\",\"\",AQ8)","v":""},{"$f":"IF(AS9=\"\",\"\",AS9)","v":""},":",{"$f":"IF(AQ9=\"\",\"\",AQ9)","v":""},{"$f":"IF(AS10=\"\",\"\",AS10)","v":""},":",{"$f":"IF(AQ10=\"\",\"\",AQ10)","v":""},{"$f":"IF(AS11=\"\",\"\",AS11)","v":""},":",{"$f":"IF(AQ11=\"\",\"\",AQ11)","v":""},{"$f":"IF(AS12=\"\",\"\",AS12)","v":""},":",{"$f":"IF(AQ12=\"\",\"\",AQ12)","v":""},{"$f":"IF(AS13=\"\",\"\",AS13)","v":""},":",{"$f":"IF(AQ13=\"\",\"\",AQ13)","v":""},{"$f":"IF(AS14=\"\",\"\",AS14)","v":""},":",{"$f":"IF(AQ14=\"\",\"\",AQ14)","v":""},{"$f":"IF(AS15=\"\",\"\",AS15)","v":""},":",{"$f":"IF(AQ15=\"\",\"\",AQ15)","v":""},{"$f":"IF(AS16=\"\",\"\",AS16)","v":""},":",{"$f":"IF(AQ16=\"\",\"\",AQ16)","v":""},{"$f":"IF(AS17=\"\",\"\",AS17)","v":""},":",{"$f":"IF(AQ17=\"\",\"\",AQ17)","v":""},null,null,null,null,":",null,0,0,0,0,0,":",0,0,"",{"$f":"IF(G18=\"\",\"\",IF(G18>I18,3,IF(G18=I18,1,0)))","v":""},{"$f":"IF(J18=\"\",\"\",IF(J18>L18,3,IF(J18=L18,1,0)))","v":""},{"$f":"IF(M18=\"\",\"\",IF(M18>O18,3,IF(M18=O18,1,0)))","v":""},{"$f":"IF(P18=\"\",\"\",IF(P18>R18,3,IF(P18=R18,1,0)))","v":""},"","","","",{"$f":"IF(AE18=\"\",\"\",IF(AE18>AG18,3,IF(AE18=AG18,1,0)))","v":""},{"$f":"IF(AH18=\"\",\"\",IF(AH18>AJ18,3,IF(AH18=AJ18,1,0)))","v":""},{"$f":"IF(AK18=\"\",\"\",IF(AK18>AM18,3,IF(AK18=AM18,1,0)))","v":""},"","","vyrovnané","vynikající"]
["A15",null,15,{"$f":"IF(AV6=\"\",\"\",AV6)","v":""},":",{"$f":"IF(AT6=\"\",\"\",AT6)","v":""},{"$f":"IF(AV7=\"\",\"\",AV7)","v":""},":",{"$f":"IF(AT7=\"\",\"\",AT7)","v":""},{"$f":"IF(AV7=\"\",\"\",AV7)","v":""},":",{"$f":"IF(AT7=\"\",\"\",AT7)","v":""},{"$f":"IF(AV8=\"\",\"\",AV8)","v":""},":",{"$f":"IF(AT8=\"\",\"\",AT8)","v":""},{"$f":"IF(AV9=\"\",\"\",AV9)","v":""},":",{"$f":"IF(AT9=\"\",\"\",AT9)","v":""},{"$f":"IF(AV10=\"\",\"\",AV10)","v":""},":",{"$f":"IF(AT10=\"\",\"\",AT10)","v":""},{"$f":"IF(AV11=\"\",\"\",AV11)","v":""},":",{"$f":"IF(AT7=\"\",\"\",AT7)","v":""},{"$f":"IF(AV12=\"\",\"\",AV12)","v":""},":",{"$f":"IF(AT12=\"\",\"\",AT12)","v":""},{"$f":"IF(AV13=\"\",\"\",AV13)","v":""},":",{"$f":"IF(AT13=\"\",\"\",AT13)","v":""},{"$f":"IF(AV14=\"\",\"\",AV14)","v":""},":",{"$f":"IF(AT14=\"\",\"\",AT14)","v":""},{"$f":"IF(AV15=\"\",\"\",AV15)","v":""},":",{"$f":"IF(AT15=\"\",\"\",AT15)","v":""},{"$f":"IF(AV16=\"\",\"\",AV16)","v":""},":",{"$f":"IF(AT16=\"\",\"\",AT16)","v":""},{"$f":"IF(AV17=\"\",\"\",AV17)","v":""},":",{"$f":"IF(AT17=\"\",\"\",AT17)","v":""},{"$f":"IF(AV18=\"\",\"\",AV18)","v":""},":",{"$f":"IF(AT18=\"\",\"\",AT18)","v":""},null,null,null,0,0,0,0,0,":",0,0,{"$f":"IF(D19=\"\",\"\",IF(D19>F19,3,IF(D19=F19,1,0)))","v":""},{"$f":"IF(G19=\"\",\"\",IF(G19>I19,3,IF(G19=I19,1,0)))","v":""},{"$f":"IF(J19=\"\",\"\",IF(J19>L19,3,IF(J19=L19,1,0)))","v":""},{"$f":"IF(M19=\"\",\"\",IF(M19>O19,3,IF(M19=O19,1,0)))","v":""},{"$f":"IF(P19=\"\",\"\",IF(P19>R19,3,IF(P19=R19,1,0)))","v":""},"","","","",{"$f":"IF(AE19=\"\",\"\",IF(AE19>AG19,3,IF(AE19=AG19,1,0)))","v":""},{"$f":"IF(AH19=\"\",\"\",IF(AH19>AJ19,3,IF(AH19=AJ19,1,0)))","v":""},{"$f":"IF(AK19=\"\",\"\",IF(AK19>AM19,3,IF(AK19=AM19,1,0)))","v":""},"","","vyrovnané","vynikající"]
[]
[null,null,"   O PŘEPNUTÍ MEZI TABULKAMI SI ŘEKNĚTE U OBSLUHY PC         TOTO NENÍ DOTYKOVÁ OBRAZOVKA"]
[]
[null,null,null,null,"V tabulce musí být prázdný řádek a sloupec"]

{"sheet":"Pořadí 5","index":8,"n_rows":20,"n_cols":22,"rows_kept":20,"cut":false,"hidden":false,"merged":[[0,0,0,10],[1,6,1,8]]}
[{"$f":"'SKUPINA 5'!$A$1","v":"SKUPINA 5 hlavního turnaje v kategorii U9"}]
[null,null,"Utkání celkem","Vítězství","Remízy","Prohry","Skóre",null,null,"Rozdíl","Body","Hodnocení skóre","Hodnocení družstva"]
[17,{"$f":"'SKUPINA 5'!C8","v":"FC Hradec Králové"},{"$f":"SUM('SKUPINA 5'!AW8,Jaro!BE7)","v":3},{"$f":"SUM('SKUPINA 5'!AX8,Jaro!BF7)","v":3},{"$f":"SUM('SKUPINA 5'!AY8,Jaro!BG7)","v":0},{"$f":"SUM('SKUPINA 5'!AZ8,Jaro!BH7)","v":0},{"$f":"SUM('SKUPINA 5'!BA8,Jaro!BI7)","v":10},":",{"$f":"SUM('SKUPINA 5'!BC8,Jaro!BK7)","v":7},{"$f":"SUM(G3-I3)","v":3},{"$f":"SUM('SKUPINA 5'!BD8,Jaro!BL7)","v":9},{"$f":"IF(G1>I1,\"aktivní\",IF(G1=I1,\"vyrovnané\",\"pasivní\"))","v":"vyrovnané"},{"$f":"IF(K1>=80/100*C1*3,\"vynikající\",IF(K1<50/100*C1*3,\"neúspěšné\",\"dobré\"))","v":"vynikající"}]
[18,{"$f":"'SKUPINA 5'!C6","v":"TJ Praga Vysočany"},{"$f":"SUM('SKUPINA 5'!AW6,Jaro!BE5)","v":3},{"$f":"SUM('SKUPINA 5'!AX6,Jaro!BF5)","v":1},{"$f":"SUM('SKUPINA 5'!AY6,Jaro!BG5)","v":1},{"$f":"SUM('SKUPINA 5'!AZ6,Jaro!BH5)","v":1},{"$f":"SUM('SKUPINA 5'!BA6,Jaro!BI5)","v":9},":",{"$f":"SUM('SKUPINA 5'!BC6,Jaro!BK5)","v":9},{"$f":"SUM(G4-I4)","v":0},{"$f":"SUM('SKUPINA 5'!BD6,Jaro!BL5)","v":4},{"$f":"IF(G3>I3,\"aktivní\",IF(G3=I3,\"vyrovnané\",\"pasivní\"))","v":"aktivní"},{"$f":"IF(K3>=80/100*C3*3,\"vynikající\",IF(K3<50/100*C3*3,\"neúspěšné\",\"dobré\"))","v":"vynikající"}]
[19,{"$f":"'SKUPINA 5'!C7","v":"SK Benešov"},{"$f":"SUM('SKUPINA 5'!AW7,Jaro!BE6)","v":3},{"$f":"SUM('SKUPINA 5'!AX7,Jaro!BF6)","v":1},{"$f":"SUM('SKUPINA 5'!AY7,Jaro!BG6)","v":1},{"$f":"SUM('SKUPINA 5'!AZ7,Jaro!BH6)","v":1},{"$f":"SUM('SKUPINA 5'!BA7,Jaro!BI6)","v":8},":",{"$f":"SUM('SKUPINA 5'!BC7,Jaro!BK6)","v":8},{"$f":"SUM(G5-I5)","v":0},{"$f":"SUM('SKUPINA 5'!BD7,Jaro!BL6)","v":4},{"$f":"IF(G6>I6,\"aktivní\",IF(G6=I6,\"vyrovnané\",\"pasivní\"))","v":"pasivní"},{"$f":"IF(K6>=80/100*C6*3,\"vynikající\",IF(K6<50/100*C6*3,\"neúspěšné\",\"dobré\"))","v":"neúspěšné"}]
[20,{"$f":"'SKUPINA 5'!C5","v":"1. FC Poruba"},{"$f":"SUM('SKUPINA 5'!AW5,Jaro!BE4)","v":3},{"$f":"SUM('SKUPINA 5'!AX5,Jaro!BF4)","v":0},{"$f":"SUM('SKUPINA 5'!AY5,Jaro!BG4)","v":0},{"$f":"SUM('SKUPINA 5'!AZ5,Jaro!BH4)","v":3},{"$f":"SUM('SKUPINA 5'!BA5,Jaro!BI4)","v":8},":",{"$f":"SUM('SKUPINA 5'!BC5,Jaro!BK4)","v":11},{"$f":"SUM(G6-I6)","v":-3},{"$f":"SUM('SKUPINA 5'!BD5,Jaro!BL4)","v":0},{"$f":"IF(G4>I4,\"aktivní\",IF(G4=I4,\"vyrovnané\",\"pasivní\"))","v":"vyrovnané"},{"$f":"IF(K4>=80/100*C4*3,\"vynikající\",IF(K4<50/100*C4*3,\"neúspěšné\",\"dobré\"))","v":"neúspěšné"}]
[5,{"$f":"'SKUPINA 3'!C10","v":6},{"$f":"SUM('SKUPINA 3'!AW10,Jaro!BE9)","v":0},{"$f":"SUM('SKUPINA 3'!AX10,Jaro!BF9)","v":0},{"$f":"SUM('SKUPINA 3'!AY10,Jaro!BG9)","v":0},{"$f":"SUM('SKUPINA 3'!AZ10,Jaro!BH9)","v":0},{"$f":"SUM('SKUPINA 3'!BA10,Jaro!BI9)","v":0},":",{"$f":"SUM('SKUPINA 3'!BC10,Jaro!BK9)","v":0},{"$f":"SUM(G7-I7)","v":0},{"$f":"SUM('SKUPINA 3'!BD10,Jaro!BL9)","v":0},{"$f":"IF(G6>I6,\"aktivní\",IF(G6=I6,\"vyrovnané\",\"pasivní\"))","v":"pasivní"},{"$f":"IF(K6>=80/100*C6*3,\"vynikající\",IF(K6<50/100*C6*3,\"neúspěšné\",\"dobré\"))","v":"neúspěšné"}]
[6,{"$f":"'SKUPINA 3'!C11","v":7},{"$f":"SUM('SKUPINA 3'!AW11,Jaro!BE10)","v":0},{"$f":"SUM('SKUPINA 3'!AX11,Jaro!BF10)","v":0},{"$f":"SUM('SKUPINA 3'!AY11,Jaro!BG10)","v":0},{"$f":"SUM('SKUPINA 3'!AZ11,Jaro!BH10)","v":0},{"$f":"SUM('SKUPINA 3'!BA11,Jaro!BI10)","v":0},":",{"$f":"SUM('SKUPINA 3'!BC11,Jaro!BK10)","v":0},{"$f":"SUM(G8-I8)","v":0},{"$f":"SUM('SKUPINA 3'!BD11,Jaro!BL10)","v":0},{"$f":"IF(G7>I7,\"aktivní\",IF(G7=I7,\"vyrovnané\",\"pasivní\"))","v":"vyrovnané"},{"$f":"IF(K7>=80/100*C7*3,\"vynikající\",IF(K7<50/100*C7*3,\"neúspěšné\",\"dobré\"))","v":"vynikající"}]
[6,{"$f":"'SKUPINA 3'!C12","v":8},{"$f":"SUM('SKUPINA 3'!AW12,Jaro!BE11)","v":0},{"$f":"SUM('SKUPINA 3'!AX12,Jaro!BF11)","v":0},{"$f":"SUM('SKUPINA 3'!AY12,Jaro!BG11)","v":0},{"$f":"SUM('SKUPINA 3'!AZ12,Jaro!BH11)","v":0},{"$f":"SUM('SKUPINA 3'!BA12,Jaro!BI11)","v":0},":",{"$f":"SUM('SKUPINA 3'!BC12,Jaro!BK11)","v":0},{"$f":"SUM(G9-I9)","v":0},{"$f":"SUM('SKUPINA 3'!BD12,Jaro!BL11)","v":0},{"$f":"IF(G8>I8,\"aktivní\",IF(G8=I8,\"vyrovnané\",\"pasivní\"))","v":"vyrovnané"},{"$f":"IF(K8>=80/100*C8*3,\"vynikající\",IF(K8<50/100*C8*3,\"neúspěšné\",\"dobré\"))","v":"vynikající"}]
[7,{"$f":"'SKUPINA 3'!C13","v":9},{"$f":"SUM('SKUPINA 3'!AW13,Jaro!BE12)","v":0},{"$f":"SUM('SKUPINA 3'!AX13,Jaro!BF12)","v":0},{"$f":"SUM('SKUPINA 3'!AY13,Jaro!BG12)","v":0},{"$f":"SUM('SKUPINA 3'!AZ13,Jaro!BH12)","v":0},{"$f":"SUM('SKUPINA 3'!BA13,Jaro!BI12)","v":0},":",{"$f":"SUM('SKUPINA 3'!BC13,Jaro!BK12)","v":0},{"$f":"SUM(G10-I10)","v":0},{"$f":"SUM('SKUPINA 3'!BD13,Jaro!BL12)","v":0},{"$f":"IF(G9>I9,\"aktivní\",IF(G9=I9,\"vyrovnané\",\"pasivní\"))","v":"vyrovnané"},{"$f":"IF(K9>=80/100*C9*3,\"vynikající\",IF(K9<50/100*C9*3,\"neúspěšné\",\"dobré\"))","v":"vynikající"}]
[8,{"$f":"'SKUPINA 3'!C14","v":10},{"$f":"SUM('SKUPINA 3'!AW14,Jaro!BE13)","v":0},{"$f":"SUM('SKUPINA 3'!AX14,Jaro!BF13)","v":0},{"$f":"SUM('SKUPINA 3'!AY14,Jaro!BG13)","v":0},{"$f":"SUM('SKUPINA 3'!AZ14,Jaro!BH13)","v":0},{"$f":"SUM('SKUPINA 3'!BA14,Jaro!BI13)","v":0},":",{"$f":"SUM('SKUPINA 3'!BC14,Jaro!BK13)","v":0},{"$f":"SUM(G11-I11)","v":0},{"$f":"SUM('SKUPINA 3'!BD14,Jaro!BL13)","v":0},{"$f":"IF(G10>I10,\"aktivní\",IF(G10=I10,\"vyrovnané\",\"pasivní\"))","v":"vyrovnané"},{"$f":"IF(K10>=80/100*C10*3,\"vynikající\",IF(K10<50/100*C10*3,\"neúspěšné\",\"dobré\"))","v":"vynikající"}]
[9,{"$f":"'SKUPINA 3'!C15","v":11},{"$f":"SUM('SKUPINA 3'!AW15,Jaro!BE14)","v":0},{"$f":"SUM('SKUPINA 3'!AX15,Jaro!BF14)","v":0},{"$f":"SUM('SKUPINA 3'!AY15,Jaro!BG14)","v":0},{"$f":"SUM('SKUPINA 3'!AZ15,Jaro!BH14)","v":0},{"$f":"SUM('SKUPINA 3'!BA15,Jaro!BI14)","v":0},":",{"$f":"SUM('SKUPINA 3'!BC15,Jaro!BK14)","v":0},{"$f":"SUM(G12-I12)","v":0},{"$f":"SUM('SKUPINA 3'!BD15,Jaro!BL14)","v":0},{"$f":"IF(G11>I11,\"aktivní\",IF(G11=I11,\"vyrovnané\",\"pasivní\"))","v":"vyrovnané"},{"$f":"IF(K11>=80/100*C11*3,\"vynikající\",IF(K11<50/100*C11*3,\"neúspěšné\",\"dobré\"))","v":"vynikající"},null,null,null,null,null,null,null,null,"´´"]
[10,{"$f":"'SKUPINA 3'!C16","v":12},{"$f":"SUM('SKUPINA 3'!AW16,Jaro!BE15)","v":0},{"$f":"SUM('SKUPINA 3'!AX16,Jaro!BF15)","v":0},{"$f":"SUM('SKUPINA 3'!AY16,Jaro!BG15)","v":0},{"$f":"SUM('SKUPINA 3'!AZ16,Jaro!BH15)","v":0},{"$f":"SUM('SKUPINA 3'!BA16,Jaro!BI15)","v":0},":",{"$f":"SUM('SKUPINA 3'!BC16,Jaro!BK15)","v":0},{"$f":"SUM(G13-I13)","v":0},{"$f":"SUM('SKUPINA 3'!BD16,Jaro!BL15)","v":0},{"$f":"IF(G12>I12,\"aktivní\",IF(G12=I12,\"vyrovnané\",\"pasivní\"))","v":"vyrovnané"},{"$f":"IF(K12>=80/100*C12*3,\"vynikající\",IF(K12<50/100*C12*3,\"neúspěšné\",\"dobré\"))","v":"vynikající"}]
[11,{"$f":"'SKUPINA 3'!C17","v":13},{"$f":"SUM('SKUPINA 3'!AW17,Jaro!BE16)","v":0},{"$f":"SUM('SKUPINA 3'!AX17,Jaro!BF16)","v":0},{"$f":"SUM('SKUPINA 3'!AY17,Jaro!BG16)","v":0},{"$f":"SUM('SKUPINA 3'!AZ17,Jaro!BH16)","v":0},{"$f":"SUM('SKUPINA 3'!BA17,Jaro!BI16)","v":0},":",{"$f":"SUM('SKUPINA 3'!BC17,Jaro!BK16)","v":0},{"$f":"SUM(G14-I14)","v":0},{"$f":"SUM('SKUPINA 3'!BD17,Jaro!BL16)","v":0},{"$f":"IF(G13>I13,\"aktivní\",IF(G13=I13,\"vyrovnané\",\"pasivní\"))","v":"vyrovnané"},{"$f":"IF(K13>=80/100*C13*3,\"vynikající\",IF(K13<50/100*C13*3,\"neúspěšné\",\"dobré\"))","v":"vynikající"}]
[13,{"$f":"'SKUPINA 3'!C18","v":14},{"$f":"SUM('SKUPINA 3'!AW18,Jaro!BE17)","v":0},{"$f":"SUM('SKUPINA 3'!AX18,Jaro!BF17)","v":0},{"$f":"SUM('SKUPINA 3'!AY18,Jaro!BG17)","v":0},{"$f":"SUM('SKUPINA 3'!AZ18,Jaro!BH17)","v":0},{"$f":"SUM('SKUPINA 3'!BA18,Jaro!BI17)","v":0},":",{"$f":"SUM('SKUPINA 3'!BC18,Jaro!BK17)","v":0},{"$f":"SUM(G15-I15)","v":0},{"$f":"SUM('SKUPINA 3'!BD18,Jaro!BL17)","v":0},{"$f":"IF(G14>I14,\"aktivní\",IF(G14=I14,\"vyrovnané\",\"pasivní\"))","v":"vyrovnané"},{"$f":"IF(K14>=80/100*C14*3,\"vynikající\",IF(K14<50/100*C14*3,\"neúspěšné\",\"dobré\"))","v":"vynikající"}]
[14,{"$f":"'SKUPINA 3'!C6","v":"FK Meteor Praha"},{"$f":"SUM('SKUPINA 3'!AW6,Jaro!BE5)","v":3},{"$f":"SUM('SKUPINA 3'!AX6,Jaro!BF5)","v":3},{"$f":"SUM('SKUPINA 3'!AY6,Jaro!BG5)","v":0},{"$f":"SUM('SKUPINA 3'!AZ6,Jaro!BH5)","v":0},{"$f":"SUM('SKUPINA 3'!BA6,Jaro!BI5)","v":12},":",{"$f":"SUM('SKUPINA 3'!BC6,Jaro!BK5)","v":5},{"$f":"SUM(G16-I16)","v":7},{"$f":"SUM('SKUPINA 3'!BD6,Jaro!BL5)","v":9},{"$f":"IF(G15>I15,\"aktivní\",IF(G15=I15,\"vyrovnané\",\"pasivní\"))","v":"vyrovnané"},{"$f":"IF(K15>=80/100*C15*3,\"vynikající\",IF(K15<50/100*C15*3,\"neúspěšné\",\"dobré\"))","v":"vynikající"}]
[]
[]
[]
[null,"TOTO NENÍ DOTYKOVÁ OBRAZOVKA"]

{"sheet":"Pořadí 6","index":9,"n_rows":20,"n_cols":22,"rows_kept":20,"cut":false,"hidden":false,"merged":[[0,0,0,10],[1,6,1,8]]}
[{"$f":"'SKUPINA 6'!$A$1","v":"SKUPINA 6 hlavního turnaje v kategorii U9"}]
[null,null,"Utkání celkem","Vítězství","Remízy","Prohry","Skóre",null,null,"Rozdíl","Body","Hodnocení skóre","Hodnocení družstva"]
[21,{"$f":"'SKUPINA 6'!C6","v":"FK Ústí nad Labem"},{"$f":"SUM('SKUPINA 6'!AW6,Jaro!BE5)","v":3},{"$f":"SUM('SKUPINA 6'!AX6,Jaro!BF5)","v":2},{"$f":"SUM('SKUPINA 6'!AY6,Jaro!BG5)","v":1},{"$f":"SUM('SKUPINA 6'!AZ6,Jaro!BH5)","v":0},{"$f":"SUM('SKUPINA 6'!BA6,Jaro!BI5)","v":19},":",{"$f":"SUM('SKUPINA 6'!BC6,Jaro!BK5)","v":13},{"$f":"SUM(G3-I3)","v":6},{"$f":"SUM('SKUPINA 6'!BD6,Jaro!BL5)","v":7},{"$f":"IF(G2>I2,\"aktivní\",IF(G2=I2,\"vyrovnané\",\"pasivní\"))","v":"aktivní"},{"$f":"IF(K2>=80/100*C2*3,\"vynikající\",IF(K2<50/100*C2*3,\"neúspěšné\",\"dobré\"))","v":{"$error":"#VALUE!"}}]
[22,{"$f":"'SKUPINA 6'!C5","v":"TJ Viktorka Vestec"},{"$f":"SUM('SKUPINA 6'!AW5,Jaro!BE4)","v":3},{"$f":"SUM('SKUPINA 6'!AX5,Jaro!BF4)","v":2},{"$f":"SUM('SKUPINA 6'!AY5,Jaro!BG4)","v":0},{"$f":"SUM('SKUPINA 6'!AZ5,Jaro!BH4)","v":1},{"$f":"SUM('SKUPINA 6'!BA5,Jaro!BI4)","v":18},":",{"$f":"SUM('SKUPINA 6'!BC5,Jaro!BK4)","v":10},{"$f":"SUM(G4-I4)","v":8},{"$f":"SUM('SKUPINA 6'!BD5,Jaro!BL4)","v":6},{"$f":"IF(G2>I2,\"aktivní\",IF(G2=I2,\"vyrovnané\",\"pasivní\"))","v":"aktivní"},{"$f":"IF(K2>=80/100*C2*3,\"vynikající\",IF(K2<50/100*C2*3,\"neúspěšné\",\"dobré\"))","v":{"$error":"#VALUE!"}}]
[23,{"$f":"'SKUPINA 6'!C7","v":"FK Junior Strakonice"},{"$f":"SUM('SKUPINA 6'!AW7,Jaro!BE6)","v":3},{"$f":"SUM('SKUPINA 3'!AX7,Jaro!BF6)","v":1},{"$f":"SUM('SKUPINA 6'!AY7,Jaro!BG6)","v":1},{"$f":"SUM('SKUPINA 6'!AZ7,Jaro!BH6)","v":1},{"$f":"SUM('SKUPINA 6'!BA7,Jaro!BI6)","v":16},":",{"$f":"SUM('SKUPINA 6'!BC7,Jaro!BK6)","v":13},{"$f":"SUM(G5-I5)","v":3},{"$f":"SUM('SKUPINA 6'!BD7,Jaro!BL6)","v":4},{"$f":"IF(G6>I6,\"aktivní\",IF(G6=I6,\"vyrovnané\",\"pasivní\"))","v":"pasivní"},{"$f":"IF(K6>=80/100*C6*3,\"vynikající\",IF(K6<50/100*C6*3,\"neúspěšné\",\"dobré\"))","v":"neúspěšné"}]
[24,{"$f":"'SKUPINA 6'!C8","v":"FK Spartak Choceň"},{"$f":"SUM('SKUPINA 6'!AW8,Jaro!BE7)","v":3},{"$f":"SUM('SKUPINA 6'!AX8,Jaro!BF7)","v":0},{"$f":"SUM('SKUPINA 6'!AY8,Jaro!BG7)","v":0},{"$f":"SUM('SKUPINA 6'!AZ8,Jaro!BH7)","v":3},{"$f":"SUM('SKUPINA 6'!BA8,Jaro!BI7)","v":5},":",{"$f":"SUM('SKUPINA 6'!BC8,Jaro!BK7)","v":22},{"$f":"SUM(G6-I6)","v":-17},{"$f":"SUM('SKUPINA 6'!BD8,Jaro!BL7)","v":0},{"$f":"IF(G4>I4,\"aktivní\",IF(G4=I4,\"vyrovnané\",\"pasivní\"))","v":"aktivní"},{"$f":"IF(K4>=80/100*C4*3,\"vynikající\",IF(K4<50/100*C4*3,\"neúspěšné\",\"dobré\"))","v":"dobré"}]
[5,{"$f":"'SKUPINA 3'!C10","v":6},{"$f":"SUM('SKUPINA 3'!AW10,Jaro!BE9)","v":0},{"$f":"SUM('SKUPINA 3'!AX10,Jaro!BF9)","v":0},{"$f":"SUM('SKUPINA 3'!AY10,Jaro!BG9)","v":0},{"$f":"SUM('SKUPINA 3'!AZ10,Jaro!BH9)","v":0},{"$f":"SUM('SKUPINA 3'!BA10,Jaro!BI9)","v":0},":",{"$f":"SUM('SKUPINA 3'!BC10,Jaro!BK9)","v":0},{"$f":"SUM(G7-I7)","v":0},{"$f":"SUM('SKUPINA 3'!BD10,Jaro!BL9)","v":0},{"$f":"IF(G6>I6,\"aktivní\",IF(G6=I6,\"vyrovnané\",\"pasivní\"))","v":"pasivní"},{"$f":"IF(K6>=80/100*C6*3,\"vynikající\",IF(K6<50/100*C6*3,\"neúspěšné\",\"dobré\"))","v":"neúspěšné"}]
[6,{"$f":"'SKUPINA 3'!C11","v":7},{"$f":"SUM('SKUPINA 3'!AW11,Jaro!BE10)","v":0},{"$f":"SUM('SKUPINA 3'!AX11,Jaro!BF10)","v":0},{"$f":"SUM('SKUPINA 3'!AY11,Jaro!BG10)","v":0},{"$f":"SUM('SKUPINA 3'!AZ11,Jaro!BH10)","v":0},{"$f":"SUM('SKUPINA 3'!BA11,Jaro!BI10)","v":0},":",{"$f":"SUM('SKUPINA 3'!BC11,Jaro!BK10)","v":0},{"$f":"SUM(G8-I8)","v":0},{"$f":"SUM('SKUPINA 3'!BD11,Jaro!BL10)","v":0},{"$f":"IF(G7>I7,\"aktivní\",IF(G7=I7,\"vyrovnané\",\"pasivní\"))","v":"vyrovnané"},{"$f":"IF(K7>=80/100*C7*3,\"vynikající\",IF(K7<50/100*C7*3,\"neúspěšné\",\"dobré\"))","v":"vynikající"}]
[6,{"$f":"'SKUPINA 3'!C12","v":8},{"$f":"SUM('SKUPINA 3'!AW12,Jaro!BE11)","v":0},{"$f":"SUM('SKUPINA 3'!AX12,Jaro!BF11)","v":0},{"$f":"SUM('SKUPINA 3'!AY12,Jaro!BG11)","v":0},{"$f":"SUM('SKUPINA 3'!AZ12,Jaro!BH11)","v":0},{"$f":"SUM('SKUPINA 3'!BA12,Jaro!BI11)","v":0},":",{"$f":"SUM('SKUPINA 3'!BC12,Jaro!BK11)","v":0},{"$f":"SUM(G9-I9)","v":0},{"$f":"SUM('SKUPINA 3'!BD12,Jaro!BL11)","v":0},{"$f":"IF(G8>I8,\"aktivní\",IF(G8=I8,\"vyrovnané\",\"pasivní\"))","v":"vyrovnané"},{"$f":"IF(K8>=80/100*C8*3,\"vynikající\",IF(K8<50/100*C8*3,\"neúspěšné\",\"dobré\"))","v":"vynikající"}]
[7,{"$f":"'SKUPINA 3'!C13","v":9},{"$f":"SUM('SKUPINA 3'!AW13,Jaro!BE12)","v":0},{"$f":"SUM('SKUPINA 3'!AX13,Jaro!BF12)","v":0},{"$f":"SUM('SKUPINA 3'!AY13,Jaro!BG12)","v":0},{"$f":"SUM('SKUPINA 3'!AZ13,Jaro!BH12)","v":0},{"$f":"SUM('SKUPINA 3'!BA13,Jaro!BI12)","v":0},":",{"$f":"SUM('SKUPINA 3'!BC13,Jaro!BK12)","v":0},{"$f":"SUM(G10-I10)","v":0},{"$f":"SUM('SKUPINA 3'!BD13,Jaro!BL12)","v":0},{"$f":"IF(G9>I9,\"aktivní\",IF(G9=I9,\"vyrovnané\",\"pasivní\"))","v":"vyrovnané"},{"$f":"IF(K9>=80/100*C9*3,\"vynikající\",IF(K9<50/100*C9*3,\"neúspěšné\",\"dobré\"))","v":"vynikající"}]
[8,{"$f":"'SKUPINA 3'!C14","v":10},{"$f":"SUM('SKUPINA 3'!AW14,Jaro!BE13)","v":0},{"$f":"SUM('SKUPINA 3'!AX14,Jaro!BF13)","v":0},{"$f":"SUM('SKUPINA 3'!AY14,Jaro!BG13)","v":0},{"$f":"SUM('SKUPINA 3'!AZ14,Jaro!BH13)","v":0},{"$f":"SUM('SKUPINA 3'!BA14,Jaro!BI13)","v":0},":",{"$f":"SUM('SKUPINA 3'!BC14,Jaro!BK13)","v":0},{"$f":"SUM(G11-I11)","v":0},{"$f":"SUM('SKUPINA 3'!BD14,Jaro!BL13)","v":0},{"$f":"IF(G10>I10,\"aktivní\",IF(G10=I10,\"vyrovnané\",\"pasivní\"))","v":"vyrovnané"},{"$f":"IF(K10>=80/100*C10*3,\"vynikající\",IF(K10<50/100*C10*3,\"neúspěšné\",\"dobré\"))","v":"vynikající"}]
[9,{"$f":"'SKUPINA 3'!C15","v":11},{"$f":"SUM('SKUPINA 3'!AW15,Jaro!BE14)","v":0},{"$f":"SUM('SKUPINA 3'!AX15,Jaro!BF14)","v":0},{"$f":"SUM('SKUPINA 3'!AY15,Jaro!BG14)","v":0},{"$f":"SUM('SKUPINA 3'!AZ15,Jaro!BH14)","v":0},{"$f":"SUM('SKUPINA 3'!BA15,Jaro!BI14)","v":0},":",{"$f":"SUM('SKUPINA 3'!BC15,Jaro!BK14)","v":0},{"$f":"SUM(G12-I12)","v":0},{"$f":"SUM('SKUPINA 3'!BD15,Jaro!BL14)","v":0},{"$f":"IF(G11>I11,\"aktivní\",IF(G11=I11,\"vyrovnané\",\"pasivní\"))","v":"vyrovnané"},{"$f":"IF(K11>=80/100*C11*3,\"vynikající\",IF(K11<50/100*C11*3,\"neúspěšné\",\"dobré\"))","v":"vynikající"},null,null,null,null,null,null,null,null,"´´"]
[10,{"$f":"'SKUPINA 3'!C16","v":12},{"$f":"SUM('SKUPINA 3'!AW16,Jaro!BE15)","v":0},{"$f":"SUM('SKUPINA 3'!AX16,Jaro!BF15)","v":0},{"$f":"SUM('SKUPINA 3'!AY16,Jaro!BG15)","v":0},{"$f":"SUM('SKUPINA 3'!AZ16,Jaro!BH15)","v":0},{"$f":"SUM('SKUPINA 3'!BA16,Jaro!BI15)","v":0},":",{"$f":"SUM('SKUPINA 3'!BC16,Jaro!BK15)","v":0},{"$f":"SUM(G13-I13)","v":0},{"$f":"SUM('SKUPINA 3'!BD16,Jaro!BL15)","v":0},{"$f":"IF(G12>I12,\"aktivní\",IF(G12=I12,\"vyrovnané\",\"pasivní\"))","v":"vyrovnané"},{"$f":"IF(K12>=80/100*C12*3,\"vynikající\",IF(K12<50/100*C12*3,\"neúspěšné\",\"dobré\"))","v":"vynikající"}]
[11,{"$f":"'SKUPINA 3'!C17","v":13},{"$f":"SUM('SKUPINA 3'!AW17,Jaro!BE16)","v":0},{"$f":"SUM('SKUPINA 3'!AX17,Jaro!BF16)","v":0},{"$f":"SUM('SKUPINA 3'!AY17,Jaro!BG16)","v":0},{"$f":"SUM('SKUPINA 3'!AZ17,Jaro!BH16)","v":0},{"$f":"SUM('SKUPINA 3'!BA17,Jaro!BI16)","v":0},":",{"$f":"SUM('SKUPINA 3'!BC17,Jaro!BK16)","v":0},{"$f":"SUM(G14-I14)","v":0},{"$f":"SUM('SKUPINA 3'!BD17,Jaro!BL16)","v":0},{"$f":"IF(G13>I13,\"aktivní\",IF(G13=I13,\"vyrovnané\",\"pasivní\"))","v":"vyrovnané"},{"$f":"IF(K13>=80/100*C13*3,\"vynikající\",IF(K13<50/100*C13*3,\"neúspěšné\",\"dobré\"))","v":"vynikající"}]
[13,{"$f":"'SKUPINA 3'!C18","v":14},{"$f":"SUM('SKUPINA 3'!AW18,Jaro!BE17)","v":0},{"$f":"SUM('SKUPINA 3'!AX18,Jaro!BF17)","v":0},{"$f":"SUM('SKUPINA 3'!AY18,Jaro!BG17)","v":0},{"$f":"SUM('SKUPINA 3'!AZ18,Jaro!BH17)","v":0},{"$f":"SUM('SKUPINA 3'!BA18,Jaro!BI17)","v":0},":",{"$f":"SUM('SKUPINA 3'!BC18,Jaro!BK17)","v":0},{"$f":"SUM(G15-I15)","v":0},{"$f":"SUM('SKUPINA 3'!BD18,Jaro!BL17)","v":0},{"$f":"IF(G14>I14,\"aktivní\",IF(G14=I14,\"vyrovnané\",\"pasivní\"))","v":"vyrovnané"},{"$f":"IF(K14>=80/100*C14*3,\"vynikající\",IF(K14<50/100*C14*3,\"neúspěšné\",\"dobré\"))","v":"vynikající"}]
[14,{"$f":"'SKUPINA 3'!C6","v":"FK Meteor Praha"},{"$f":"SUM('SKUPINA 3'!AW6,Jaro!BE5)","v":3},{"$f":"SUM('SKUPINA 3'!AX6,Jaro!BF5)","v":3},{"$f":"SUM('SKUPINA 3'!AY6,Jaro!BG5)","v":0},{"$f":"SUM('SKUPINA 3'!AZ6,Jaro!BH5)","v":0},{"$f":"SUM('SKUPINA 3'!BA6,Jaro!BI5)","v":12},":",{"$f":"SUM('SKUPINA 3'!BC6,Jaro!BK5)","v":5},{"$f":"SUM(G16-I16)","v":7},{"$f":"SUM('SKUPINA 3'!BD6,Jaro!BL5)","v":9},{"$f":"IF(G15>I15,\"aktivní\",IF(G15=I15,\"vyrovnané\",\"pasivní\"))","v":"vyrovnané"},{"$f":"IF(K15>=80/100*C15*3,\"vynikající\",IF(K15<50/100*C15*3,\"neúspěšné\",\"dobré\"))","v":"vynikající"}]
[]
[]
[]
[null,"TOTO NENÍ DOTYKOVÁ OBRAZOVKA"]

{"sheet":"SKUPINA 6","index":10,"n_rows":23,"n_cols":76,"rows_kept":23,"cut":false,"hidden":false,"merged":[[1,45,1,47],[0,0,0,55],[1,3,1,5],[1,6,1,8],[1,9,1,11],[1,12,1,14],[1,15,1,17],[1,18,1,20],[1,21,1,23],[1,24,1,26],[1,27,1,29],[1,30,1,32],[1,33,1,35],[1,36,1,38],[1,39,1,41],[1,42,1,44],[1,70,3,70],[1,71,3,71],[3,3,3,5],[3,6,3,8],[3,9,3,11],[3,12,3,14],[3,15,3,17],[3,18,3,20],[3,21,3,23],[3,24,3,26],[1,48,3,48],[1,49,3,49],[1,50,3,50],[1,51,3,51],[1,52,3,54],[1,55,3,55],[8,15,8,17],[3,27,3,29],[3,30,3,32],[3,33,3,35],[3,36,3,38],[3,45,3,47],[4,3,4,5],[5,6,5,8],[6,9,6,11],[7,12,7,14],[3,39,3,41],[3,42,3,44],[15,36,15,38],[16,39,16,41],[17,42,17,44],[18,45,18,47],[9,18,9,20],[10,21,10,23],[11,24,11,26],[12,27,12,29],[13,30,13,32],[14,33,14,35]]}
["SKUPINA 6 hlavního turnaje v kategorii U9",null,null,null,null,null,null,null,null,null,null,null,null,null,null,null,null,null,null,null,null,null,null,null,null,null,null,null,null,null,null,null,null,null,null,null,null,null,null,null,null,null,null,null,null,null,null,null,null,null,null,null,null,null,null,null,null,null,null,null,null,null,null,null,null,null,null,null,null,null,null,null,"  "," "," ","  "]
[null,null,null,"A1",null,null,"A2",null,null,"A3",null,null,"A4",null,null,"A5",null,null,"A6",null,null,"A7",null,null,"A8",null,null,"A9",null,null,"A10",null,null,"A11",null,null,"A12",null,null,"A13",null,null,"A14",null,null,"A15",null,null,"Utkání celkem","Vítězství","Remízy","Prohry","Skóre",null,null,"Body",null,null,null,null,null,null,null,null,null,null,null,null,null,null,"Hodnocení skóre","Hodnocení družstva"]
[null,null,null,null,0,null,null,0,null,null,0,null,null,0,null,null,0,null,null,0,null,null,0,null,null,0,null,null,0,null,null,0,null,null,0,null,null,0,null,null,0,null,null,0,null,null,0]
[null,null,null,{"$f":"C5","v":"TJ Viktorka Vestec"},null,null,{"$f":"C6","v":"FK Ústí nad Labem"},null,null,{"$f":"C7","v":"FK Junior Strakonice"},null,null,{"$f":"C8","v":"FK Spartak Choceň"},null,null,{"$f":"C9","v":5},null,null,{"$f":"C10","v":6},null,null,7,null,null,8,null,null,9,null,null,10,null,null,11,null,null,12,null,null,{"$f":"C17","v":13},null,null,{"$f":"C18","v":14},null,null,{"$f":"C19","v":15},null,null,null,null,null,null,null,null,null,null,2,3,4,5,6,7,8,9,10,11,12,13,14,15]
["A1",null,"TJ Viktorka Vestec",null,null,null,4,":",5,6,":",4,8,":",1,null,":",null,null,":",null,null,":",null,null,":",null,null,":",null,null,":",null,null,":",null,null,":",null,null,":",null,null,":",null,null,":",null,{"$f":"COUNT(BE5:BR5)","v":3},{"$f":"COUNTIF(BE5:BR5,3)","v":2},{"$f":"COUNTIF(BE5:BR5,1)","v":0},{"$f":"COUNTIF(BE5:BR5,0)","v":1},{"$f":"SUM(D5,G5,J5,M5,P5,S5)","v":18},":",{"$f":"SUM(F5,I5,L5,O5,R5,U5)","v":10},{"$f":"SUM(BE5:BR5)","v":6},{"$f":"IF(G5=\"\",\"\",IF(G5>I5,3,IF(G5=I5,1,0)))","v":0},{"$f":"IF(J5=\"\",\"\",IF(J5>L5,3,IF(J5=L5,1,0)))","v":3},{"$f":"IF(M5=\"\",\"\",IF(M5>O5,3,IF(M5=O5,1,0)))","v":3},{"$f":"IF(P5=\"\",\"\",IF(P5>R5,3,IF(P5=R5,1,0)))","v":""},{"$f":"IF(S5=\"\",\"\",IF(S5>U5,3,IF(S5=U5,1,0)))","v":""},{"$f":"IF(V5=\"\",\"\",IF(V5>X5,3,IF(V5=X5,1,0)))","v":""},{"$f":"IF(Y5=\"\",\"\",IF(Y5>AA5,3,IF(Y5=AA5,1,0)))","v":""},{"$f":"IF(AB5=\"\",\"\",IF(AB5>AD5,3,IF(AB5=AD5,1,0)))","v":""},{"$f":"IF(AE5=\"\",\"\",IF(AE5>AG5,3,IF(AE5=AG5,1,0)))","v":""},{"$f":"IF(AH5=\"\",\"\",IF(AH5>AJ5,3,IF(AH5=AJ5,1,0)))","v":""},{"$f":"IF(AK5=\"\",\"\",IF(AK5>AM5,3,IF(AK5=AM5,1,0)))","v":""},{"$f":"IF(AN5=\"\",\"\",IF(AN5>AP5,3,IF(AN5=AP5,1,0)))","v":""},{"$f":"IF(AQ5=\"\",\"\",IF(AQ5>AS5,3,IF(AQ5=AS5,1,0)))","v":""},{"$f":"IF(AT5=\"\",\"\",IF(AT5>AV5,3,IF(AT5=AV5,1,0)))","v":""},{"$f":"IF(BA5>BC5,\"aktivní\",IF(BA5=BC5,\"vyrovnané\",\"pasivní\"))","v":"aktivní"},{"$f":"IF(BD5>=80/100*AW5*3,\"vynikající\",IF(BD5<50/100*AW5*3,\"neúspěšné\",\"dobré\"))","v":"dobré"}]
["A2",null,"FK Ústí nad Labem",{"$f":"IF(I5=\"\",\"\",I5)","v":5},":",{"$f":"IF(G5=\"\",\"\",G5)","v":4},null,null,null,6,":",6,8,":",3,null,":",null,null,":",null,null,":",null,null,":",null,null,":",null,null,":",null,null,":",null,null,":",null,null,":",null,null,":",null,null,":",null,3,{"$f":"COUNTIF(BE6:BR6,3)","v":2},1,{"$f":"COUNTIF(BE6:BR6,0)","v":0},{"$f":"SUM(D6,G6,J6,M6,P6,S6)","v":19},":",{"$f":"SUM(F6,I6,L6,O6,R6,U6)","v":13},{"$f":"SUM(BE6:BR6)","v":7},{"$f":"IF(D6=\"\",\"\",IF(D6>F6,3,IF(D6=F6,1,0)))","v":3},{"$f":"IF(J6=\"\",\"\",IF(J6>L6,3,IF(J6=L6,1,0)))","v":1},{"$f":"IF(M6=\"\",\"\",IF(M6>O6,3,IF(M6=O6,1,0)))","v":3},{"$f":"IF(P6=\"\",\"\",IF(P6>R6,3,IF(P6=R6,1,0)))","v":""},{"$f":"IF(S6=\"\",\"\",IF(S6>U6,3,IF(S6=U6,1,0)))","v":""},"","","","","","",{"$f":"IF(AN6=\"\",\"\",IF(AN6>AP6,3,IF(AN6=AP6,1,0)))","v":""},{"$f":"IF(AQ6=\"\",\"\",IF(AQ6>AS6,3,IF(AQ6=AS6,1,0)))","v":""},{"$f":"IF(AT6=\"\",\"\",IF(AT6>AV6,3,IF(AT6=AV6,1,0)))","v":""},"aktivní","dobré"]
["A3",null,"FK Junior Strakonice",{"$f":"IF(L5=\"\",\"\",L5)","v":4},":",{"$f":"IF(J5=\"\",\"\",J5)","v":6},{"$f":"IF(L6=\"\",\"\",L6)","v":6},":",{"$f":"IF(J6=\"\",\"\",J6)","v":6},null,null,null,6,":",1,null,":",null,null,":",null,null,":",null,null,":",null,null,":",null,null,":",null,null,":",null,null,":",null,null,":",null,null,":",null,null,":",null,3,1,1,1,16,":",13,{"$f":"SUM(BE7:BR7)","v":4},{"$f":"IF(D7=\"\",\"\",IF(D7>F7,3,IF(D7=F7,1,0)))","v":0},{"$f":"IF(G7=\"\",\"\",IF(G7>I7,3,IF(G7=I7,1,0)))","v":1},{"$f":"IF(M7=\"\",\"\",IF(M7>O7,3,IF(M7=O7,1,0)))","v":3},{"$f":"IF(P7=\"\",\"\",IF(P7>R7,3,IF(P7=R7,1,0)))","v":""},{"$f":"IF(S7=\"\",\"\",IF(S7>U7,3,IF(S7=U7,1,0)))","v":""},"","","","","","","","","","aktivní","neúspěšné"]
["A4",null,"FK Spartak Choceň",{"$f":"IF(O5=\"\",\"\",O5)","v":1},":",{"$f":"IF(M5=\"\",\"\",M5)","v":8},{"$f":"IF(O6=\"\",\"\",O6)","v":3},":",{"$f":"IF(M6=\"\",\"\",M6)","v":8},{"$f":"IF(O7=\"\",\"\",O7)","v":1},":",{"$f":"IF(M7=\"\",\"\",M7)","v":6},null,null,null,null,":",null,null,":",null,null,":",null,null,":",null,null,":",null,null,":",null,null,":",null,null,":",null,null,":",null,null,":",null,null,":",null,3,0,0,3,5,":",22,{"$f":"SUM(BE8:BR8)","v":0},0,0,{"$f":"IF(J8=\"\",\"\",IF(J8>L8,3,IF(J8=L8,1,0)))","v":0},{"$f":"IF(P8=\"\",\"\",IF(P8>R8,3,IF(P8=R8,1,0)))","v":""},{"$f":"IF(S8=\"\",\"\",IF(S8>U8,3,IF(S8=U8,1,0)))","v":""},"","","","","","","","","","pasivní","neúspěšné"]
["A5",null,5,{"$f":"IF(R5=\"\",\"\",R5)","v":""},":",{"$f":"IF(P5=\"\",\"\",P5)","v":""},{"$f":"IF(R6=\"\",\"\",R6)","v":""},":",{"$f":"IF(P6=\"\",\"\",P6)","v":""},{"$f":"IF(R7=\"\",\"\",R7)","v":""},":",{"$f":"IF(P7=\"\",\"\",P7)","v":""},{"$f":"IF(R8=\"\",\"\",R8)","v":""},":",{"$f":"IF(P8=\"\",\"\",P8)","v":""},null,null,null,null,":",null,null,":",null,null,":",null,null,":",null,null,":",null,null,":",null,null,":",null,null,":",null,null,":",null,null,":",null,0,0,0,0,0,":",0,{"$f":"SUM(BE9:BR9)","v":0},"","",{"$f":"IF(J9=\"\",\"\",IF(J9>L9,3,IF(J9=L9,1,0)))","v":""},{"$f":"IF(M9=\"\",\"\",IF(M9>O9,3,IF(M9=O9,1,0)))","v":""},{"$f":"IF(S9=\"\",\"\",IF(S9>U9,3,IF(S9=U9,1,0)))","v":""},"","","","","","","","","","vyrovnané","vynikající"]
["A6",null,6,{"$f":"IF(U5=\"\",\"\",U5)","v":""},":",{"$f":"IF(S5=\"\",\"\",S5)","v":""},{"$f":"IF(U6=\"\",\"\",U6)","v":""},":",{"$f":"IF(S6=\"\",\"\",S6)","v":""},{"$f":"IF(U7=\"\",\"\",U7)","v":""},":",{"$f":"IF(S7=\"\",\"\",S7)","v":""},{"$f":"IF(U8=\"\",\"\",U8)","v":""},":",{"$f":"IF(S8=\"\",\"\",S8)","v":""},{"$f":"IF(U9=\"\",\"\",U9)","v":""},":",{"$f":"IF(S9=\"\",\"\",S9)","v":""},null,null,null,null,":",null,null,":",null,null,":",null,null,":",null,null,":",null,null,":",null,null,":",null,null,":",null,null,":",null,0,0,0,0,0,":",0,{"$f":"SUM(BE10:BR10)","v":0},"","","",{"$f":"IF(M10=\"\",\"\",IF(M10>O10,3,IF(M10=O10,1,0)))","v":""},{"$f":"IF(P10=\"\",\"\",IF(P10>R10,3,IF(P10=R10,1,0)))","v":""},"","","","","","","","","","vyrovnané","vynikající"]
["A7",null,7,{"$f":"IF(X5=\"\",\"\",X5)","v":""},":",{"$f":"IF(V5=\"\",\"\",V5)","v":""},{"$f":"IF(X6=\"\",\"\",X6)","v":""},":",{"$f":"IF(V6=\"\",\"\",V6)","v":""},{"$f":"IF(X7=\"\",\"\",X7)","v":""},":",{"$f":"IF(V7=\"\",\"\",V7)","v":""},{"$f":"IF(X8=\"\",\"\",X8)","v":""},":",{"$f":"IF(V8=\"\",\"\",V8)","v":""},{"$f":"IF(X9=\"\",\"\",X9)","v":""},":",{"$f":"IF(V9=\"\",\"\",V9)","v":""},{"$f":"IF(X10=\"\",\"\",X10)","v":""},":",{"$f":"IF(V10=\"\",\"\",V10)","v":""},null,null,null,null,":",null,null,":",null,null,":",null,null,":",null,null,":",null,null,":",null,null,":",null,null,":",null,0,0,0,0,{"$f":"SUM(D11,G11,J11,M11,P11,S11,V11,Y11,AB11,AE11,AH11,AK11,AN11,AQ11)","v":0},":",{"$f":"SUM(F11,I11,L11,O11,R11,U11,X11,AA11,AD11,AG11,AJ11,AM11,AP11,AS11)","v":0},0,"","","","","",{"$f":"IF(S11=\"\",\"\",IF(S11>U11,3,IF(S11=U11,1,0)))","v":""},"","","","","","","","","vyrovnané","vynikající"]
["A8",null,8,{"$f":"IF(AA5=\"\",\"\",AA5)","v":""},":",{"$f":"IF(Y5=\"\",\"\",Y5)","v":""},{"$f":"IF(AA6=\"\",\"\",AA6)","v":""},":",{"$f":"IF(Y6=\"\",\"\",Y6)","v":""},{"$f":"IF(AA7=\"\",\"\",AA7)","v":""},":",{"$f":"IF(Y7=\"\",\"\",Y7)","v":""},{"$f":"IF(AA8=\"\",\"\",AA8)","v":""},":",{"$f":"IF(Y8=\"\",\"\",Y8)","v":""},{"$f":"IF(AA9=\"\",\"\",AA9)","v":""},":",{"$f":"IF(Y9=\"\",\"\",Y9)","v":""},{"$f":"IF(AA10=\"\",\"\",AA10)","v":""},":",{"$f":"IF(Y10=\"\",\"\",Y10)","v":""},{"$f":"IF(AA11=\"\",\"\",AA11)","v":""},":",{"$f":"IF(Y11=\"\",\"\",Y11)","v":""},null,null,null,null,":",null,null,":",null,null,":",null,null,":",null,null,":",null,null,":",null,null,":",null,0,0,0,0,0,":",0,0,"","","","","","",{"$f":"IF(V12=\"\",\"\",IF(V12>X12,3,IF(V12=X12,1,0)))","v":""},{"$f":"IF(AB12=\"\",\"\",IF(AB12>AD12,3,IF(AB12=AD12,1,0)))","v":""},"","","","","","","vyrovnané","vynikající"]
["A9",null,9,{"$f":"IF(AD5=\"\",\"\",AD5)","v":""},":",{"$f":"IF(AB5=\"\",\"\",AB5)","v":""},{"$f":"IF(AD6=\"\",\"\",AD6)","v":""},":",{"$f":"IF(AB6=\"\",\"\",AB6)","v":""},{"$f":"IF(AD7=\"\",\"\",AD7)","v":""},":",{"$f":"IF(AB7=\"\",\"\",AB7)","v":""},{"$f":"IF(AD8=\"\",\"\",AD8)","v":""},":",{"$f":"IF(AB8=\"\",\"\",AB8)","v":""},{"$f":"IF(AD9=\"\",\"\",AD9)","v":""},":",{"$f":"IF(AB9=\"\",\"\",AB9)","v":""},{"$f":"IF(AD10=\"\",\"\",AD10)","v":""},":",{"$f":"IF(AB10=\"\",\"\",AB10)","v":""},{"$f":"IF(AD11=\"\",\"\",AD11)","v":""},":",{"$f":"IF(AB11=\"\",\"\",AB11)","v":""},{"$f":"IF(AD12=\"\",\"\",AD12)","v":""},":",{"$f":"IF(AB12=\"\",\"\",AB12)","v":""},null,null,null,null,":",null,null,":",null,null,":",null,null,":",null,null,":",null,null,":",null,0,0,0,0,0,":",0,0,"","","","","","","",{"$f":"IF(Y13=\"\",\"\",IF(Y13>AA13,3,IF(Y13=AA13,1,0)))","v":""},{"$f":"IF(AE13=\"\",\"\",IF(AE13>AG13,3,IF(AE13=AG13,1,0)))","v":""},"","","","","","vyrovnané","vynikající"]
["A10",null,10,{"$f":"IF(AG5=\"\",\"\",AG5)","v":""},":",{"$f":"IF(AE5=\"\",\"\",AE5)","v":""},{"$f":"IF(AG6=\"\",\"\",AG6)","v":""},":",{"$f":"IF(AE6=\"\",\"\",AE6)","v":""},{"$f":"IF(AG7=\"\",\"\",AG7)","v":""},":",{"$f":"IF(AE7=\"\",\"\",AE7)","v":""},{"$f":"IF(AG8=\"\",\"\",AG8)","v":""},":",{"$f":"IF(AE8=\"\",\"\",AE8)","v":""},{"$f":"IF(AG9=\"\",\"\",AG9)","v":""},":",{"$f":"IF(AE9=\"\",\"\",AE9)","v":""},{"$f":"IF(AG10=\"\",\"\",AG10)","v":""},":",{"$f":"IF(AE10=\"\",\"\",AE10)","v":""},{"$f":"IF(AG11=\"\",\"\",AG11)","v":""},":",{"$f":"IF(AE11=\"\",\"\",AE11)","v":""},{"$f":"IF(AG12=\"\",\"\",AG12)","v":""},":",{"$f":"IF(AE12=\"\",\"\",AE12)","v":""},{"$f":"IF(AG13=\"\",\"\",AG13)","v":""},":",{"$f":"IF(AE13=\"\",\"\",AE13)","v":""},null,null,null,null,":",null,null,":",null,null,":",null,null,":",null,null,":",null,0,0,0,0,0,":",0,0,"","","","","","","","",{"$f":"IF(AB14=\"\",\"\",IF(AB14>AD14,3,IF(AB14=AD14,1,0)))","v":""},{"$f":"IF(AH14=\"\",\"\",IF(AH14>AJ14,3,IF(AH14=AJ14,1,0)))","v":""},"","","","","vyrovnané","vynikající"]
["A11",null,11,{"$f":"IF(AJ5=\"\",\"\",AJ5)","v":""},":",{"$f":"IF(AH5=\"\",\"\",AH5)","v":""},{"$f":"IF(AJ6=\"\",\"\",AJ6)","v":""},":",{"$f":"IF(AH6=\"\",\"\",AH6)","v":""},{"$f":"IF(AJ7=\"\",\"\",AJ7)","v":""},":",{"$f":"IF(AH7=\"\",\"\",AH7)","v":""},{"$f":"IF(AJ8=\"\",\"\",AJ8)","v":""},":",{"$f":"IF(AH8=\"\",\"\",AH8)","v":""},{"$f":"IF(AJ9=\"\",\"\",AJ9)","v":""},":",{"$f":"IF(AH9=\"\",\"\",AH9)","v":""},{"$f":"IF(AJ10=\"\",\"\",AJ10)","v":""},":",{"$f":"IF(AH10=\"\",\"\",AH10)","v":""},{"$f":"IF(AJ11=\"\",\"\",AJ11)","v":""},":",{"$f":"IF(AH11=\"\",\"\",AH11)","v":""},{"$f":"IF(AJ12=\"\",\"\",AJ12)","v":""},":",{"$f":"IF(AH12=\"\",\"\",AH12)","v":""},{"$f":"IF(AJ13=\"\",\"\",AJ13)","v":""},":",{"$f":"IF(AH13=\"\",\"\",AH13)","v":""},{"$f":"IF(AJ14=\"\",\"\",AJ14)","v":""},":",{"$f":"IF(AH14=\"\",\"\",AH14)","v":""},null,null,null,null,":",null,null,":",null,null,":",null,null,":",null,0,0,0,0,0,":",0,0,"","","","","","","","","",{"$f":"IF(AE15=\"\",\"\",IF(AE15>AG15,3,IF(AE15=AG15,1,0)))","v":""},{"$f":"IF(AK15=\"\",\"\",IF(AK15>AM15,3,IF(AK15=AM15,1,0)))","v":""},"","","","vyrovnané","vynikající"]
["A12",null,12,{"$f":"IF(AM5=\"\",\"\",AM5)","v":""},":",{"$f":"IF(AK5=\"\",\"\",AK5)","v":""},{"$f":"IF(AM6=\"\",\"\",AM6)","v":""},":",{"$f":"IF(AK6=\"\",\"\",AK6)","v":""},{"$f":"IF(AM7=\"\",\"\",AM7)","v":""},":",{"$f":"IF(AK7=\"\",\"\",AK7)","v":""},{"$f":"IF(AM8=\"\",\"\",AM8)","v":""},":",{"$f":"IF(AK8=\"\",\"\",AK8)","v":""},{"$f":"IF(AM9=\"\",\"\",AM9)","v":""},":",{"$f":"IF(AK9=\"\",\"\",AK9)","v":""},{"$f":"IF(AM10=\"\",\"\",AM10)","v":""},":",{"$f":"IF(AK10=\"\",\"\",AK10)","v":""},{"$f":"IF(AM11=\"\",\"\",AM11)","v":""},":",{"$f":"IF(AK11=\"\",\"\",AK11)","v":""},{"$f":"IF(AM12=\"\",\"\",AM12)","v":""},":",{"$f":"IF(AK12=\"\",\"\",AK12)","v":""},{"$f":"IF(AM13=\"\",\"\",AM13)","v":""},":",{"$f":"IF(AK13=\"\",\"\",AK13)","v":""},{"$f":"IF(AM14=\"\",\"\",AM14)","v":""},":",{"$f":"IF(AK14=\"\",\"\",AK14)","v":""},{"$f":"IF(AM15=\"\",\"\",AM15)","v":""},":",{"$f":"IF(AK15=\"\",\"\",AK15)","v":""},null,null,null,null,":",null,null,":",null,null,":",null,0,0,0,0,0,":",0,0,"","","","","","","","","",{"$f":"IF(AE16=\"\",\"\",IF(AE16>AG16,3,IF(AE16=AG16,1,0)))","v":""},{"$f":"IF(AH16=\"\",\"\",IF(AH16>AJ16,3,IF(AH16=AJ16,1,0)))","v":""},{"$f":"IF(AN16=\"\",\"\",IF(AN16>AP16,3,IF(AN16=AP16,1,0)))","v":""},"","","vyrovnané","vynikající"]
["A13",null,13,{"$f":"IF(AP5=\"\",\"\",AP5)","v":""},":",{"$f":"IF(AN5=\"\",\"\",AN5)","v":""},{"$f":"IF(AP6=\"\",\"\",AP6)","v":""},":",{"$f":"IF(AN6=\"\",\"\",AN6)","v":""},{"$f":"IF(AP7=\"\",\"\",AP7)","v":""},":",{"$f":"IF(AN7=\"\",\"\",AN7)","v":""},{"$f":"IF(AP8=\"\",\"\",AP8)","v":""},":",{"$f":"IF(AN8=\"\",\"\",AN8)","v":""},{"$f":"IF(AP9=\"\",\"\",AP9)","v":""},":",{"$f":"IF(AN9=\"\",\"\",AN9)","v":""},{"$f":"IF(AP10=\"\",\"\",AP10)","v":""},":",{"$f":"IF(AN10=\"\",\"\",AN10)","v":""},{"$f":"IF(AP11=\"\",\"\",AP11)","v":""},":",{"$f":"IF(AN11=\"\",\"\",AN11)","v":""},{"$f":"IF(AP12=\"\",\"\",AP12)","v":""},":",{"$f":"IF(AN12=\"\",\"\",AN12)","v":""},{"$f":"IF(AP13=\"\",\"\",AP13)","v":""},":",{"$f":"IF(AN13=\"\",\"\",AN13)","v":""},{"$f":"IF(AP14=\"\",\"\",AP14)","v":""},":",{"$f":"IF(AN14=\"\",\"\",AN14)","v":""},{"$f":"IF(AP15=\"\",\"\",AP15)","v":""},":",{"$f":"IF(AN15=\"\",\"\",AN15)","v":""},{"$f":"IF(AP16=\"\",\"\",AP16)","v":""},":",{"$f":"IF(AN16=\"\",\"\",AN16)","v":""},null,null,null,null,":",null,null,":",null,0,0,0,0,0,":",0,0,"",{"$f":"IF(G17=\"\",\"\",IF(G17>I17,3,IF(G17=I17,1,0)))","v":""},{"$f":"IF(J17=\"\",\"\",IF(J17>L17,3,IF(J17=L17,1,0)))","v":""},{"$f":"IF(M17=\"\",\"\",IF(M17>O17,3,IF(M17=O17,1,0)))","v":""},{"$f":"IF(P17=\"\",\"\",IF(P17>R17,3,IF(P17=R17,1,0)))","v":""},"","","","",{"$f":"IF(AE17=\"\",\"\",IF(AE17>AG17,3,IF(AE17=AG17,1,0)))","v":""},{"$f":"IF(AH17=\"\",\"\",IF(AH17>AJ17,3,IF(AH17=AJ17,1,0)))","v":""},{"$f":"IF(AK17=\"\",\"\",IF(AK17>AM17,3,IF(AK17=AM17,1,0)))","v":""},"","","vyrovnané","vynikající"]
["A14",null,14,{"$f":"IF(AS5=\"\",\"\",AS5)","v":""},":",{"$f":"IF(AQ5=\"\",\"\",AQ5)","v":""},{"$f":"IF(AS6=\"\",\"\",AS6)","v":""},":",{"$f":"IF(AQ6=\"\",\"\",AQ6)","v":""},{"$f":"IF(AS7=\"\",\"\",AS7)","v":""},":",{"$f":"IF(AQ7=\"\",\"\",AQ7)","v":""},{"$f":"IF(AS8=\"\",\"\",AS8)","v":""},":",{"$f":"IF(AQ8=\"\",\"\",AQ8)","v":""},{"$f":"IF(AS9=\"\",\"\",AS9)","v":""},":",{"$f":"IF(AQ9=\"\",\"\",AQ9)","v":""},{"$f":"IF(AS10=\"\",\"\",AS10)","v":""},":",{"$f":"IF(AQ10=\"\",\"\",AQ10)","v":""},{"$f":"IF(AS11=\"\",\"\",AS11)","v":""},":",{"$f":"IF(AQ11=\"\",\"\",AQ11)","v":""},{"$f":"IF(AS12=\"\",\"\",AS12)","v":""},":",{"$f":"IF(AQ12=\"\",\"\",AQ12)","v":""},{"$f":"IF(AS13=\"\",\"\",AS13)","v":""},":",{"$f":"IF(AQ13=\"\",\"\",AQ13)","v":""},{"$f":"IF(AS14=\"\",\"\",AS14)","v":""},":",{"$f":"IF(AQ14=\"\",\"\",AQ14)","v":""},{"$f":"IF(AS15=\"\",\"\",AS15)","v":""},":",{"$f":"IF(AQ15=\"\",\"\",AQ15)","v":""},{"$f":"IF(AS16=\"\",\"\",AS16)","v":""},":",{"$f":"IF(AQ16=\"\",\"\",AQ16)","v":""},{"$f":"IF(AS17=\"\",\"\",AS17)","v":""},":",{"$f":"IF(AQ17=\"\",\"\",AQ17)","v":""},null,null,null,null,":",null,0,0,0,0,0,":",0,0,"",{"$f":"IF(G18=\"\",\"\",IF(G18>I18,3,IF(G18=I18,1,0)))","v":""},{"$f":"IF(J18=\"\",\"\",IF(J18>L18,3,IF(J18=L18,1,0)))","v":""},{"$f":"IF(M18=\"\",\"\",IF(M18>O18,3,IF(M18=O18,1,0)))","v":""},{"$f":"IF(P18=\"\",\"\",IF(P18>R18,3,IF(P18=R18,1,0)))","v":""},"","","","",{"$f":"IF(AE18=\"\",\"\",IF(AE18>AG18,3,IF(AE18=AG18,1,0)))","v":""},{"$f":"IF(AH18=\"\",\"\",IF(AH18>AJ18,3,IF(AH18=AJ18,1,0)))","v":""},{"$f":"IF(AK18=\"\",\"\",IF(AK18>AM18,3,IF(AK18=AM18,1,0)))","v":""},"","","vyrovnané","vynikající"]
["A15",null,15,{"$f":"IF(AV6=\"\",\"\",AV6)","v":""},":",{"$f":"IF(AT6=\"\",\"\",AT6)","v":""},{"$f":"IF(AV7=\"\",\"\",AV7)","v":""},":",{"$f":"IF(AT7=\"\",\"\",AT7)","v":""},{"$f":"IF(AV7=\"\",\"\",AV7)","v":""},":",{"$f":"IF(AT7=\"\",\"\",AT7)","v":""},{"$f":"IF(AV8=\"\",\"\",AV8)","v":""},":",{"$f":"IF(AT8=\"\",\"\",AT8)","v":""},{"$f":"IF(AV9=\"\",\"\",AV9)","v":""},":",{"$f":"IF(AT9=\"\",\"\",AT9)","v":""},{"$f":"IF(AV10=\"\",\"\",AV10)","v":""},":",{"$f":"IF(AT10=\"\",\"\",AT10)","v":""},{"$f":"IF(AV11=\"\",\"\",AV11)","v":""},":",{"$f":"IF(AT7=\"\",\"\",AT7)","v":""},{"$f":"IF(AV12=\"\",\"\",AV12)","v":""},":",{"$f":"IF(AT12=\"\",\"\",AT12)","v":""},{"$f":"IF(AV13=\"\",\"\",AV13)","v":""},":",{"$f":"IF(AT13=\"\",\"\",AT13)","v":""},{"$f":"IF(AV14=\"\",\"\",AV14)","v":""},":",{"$f":"IF(AT14=\"\",\"\",AT14)","v":""},{"$f":"IF(AV15=\"\",\"\",AV15)","v":""},":",{"$f":"IF(AT15=\"\",\"\",AT15)","v":""},{"$f":"IF(AV16=\"\",\"\",AV16)","v":""},":",{"$f":"IF(AT16=\"\",\"\",AT16)","v":""},{"$f":"IF(AV17=\"\",\"\",AV17)","v":""},":",{"$f":"IF(AT17=\"\",\"\",AT17)","v":""},{"$f":"IF(AV18=\"\",\"\",AV18)","v":""},":",{"$f":"IF(AT18=\"\",\"\",AT18)","v":""},null,null,null,0,0,0,0,0,":",0,0,{"$f":"IF(D19=\"\",\"\",IF(D19>F19,3,IF(D19=F19,1,0)))","v":""},{"$f":"IF(G19=\"\",\"\",IF(G19>I19,3,IF(G19=I19,1,0)))","v":""},{"$f":"IF(J19=\"\",\"\",IF(J19>L19,3,IF(J19=L19,1,0)))","v":""},{"$f":"IF(M19=\"\",\"\",IF(M19>O19,3,IF(M19=O19,1,0)))","v":""},{"$f":"IF(P19=\"\",\"\",IF(P19>R19,3,IF(P19=R19,1,0)))","v":""},"","","","",{"$f":"IF(AE19=\"\",\"\",IF(AE19>AG19,3,IF(AE19=AG19,1,0)))","v":""},{"$f":"IF(AH19=\"\",\"\",IF(AH19>AJ19,3,IF(AH19=AJ19,1,0)))","v":""},{"$f":"IF(AK19=\"\",\"\",IF(AK19>AM19,3,IF(AK19=AM19,1,0)))","v":""},"","","vyrovnané","vynikající"]
[]
[null,null,"   O PŘEPNUTÍ MEZI TABULKAMI SI ŘEKNĚTE U OBSLUHY PC         TOTO NENÍ DOTYKOVÁ OBRAZOVKA"]
[]
[null,null,null,null,"V tabulce musí být prázdný řádek a sloupec"]